Peptide,PTM,ModifiedAA,ModifiedPosition,PeptideUniqueToGene,ExperimentDesc,ExpID,PubmedID,ScoreType,IdentScore,LocProb,Log2FChange,PQ-val,QuantSig,PEP,MassErrorPPM
GVVAGSGTGLK,ph,S,12,true,"Tissue atlas Arabidopsis - ProteomicsDB",114,32188942,"MaxQuant score",98.1050000,0.8637920,,,,9.8231903393753E-5,
LLSSMPSRR,ph,S,269,true,"Tissue atlas Arabidopsis - ProteomicsDB",114,32188942,"MaxQuant score",79.8200000,0.9995250,,,,0.00092786102322862,
GAGIVALCATSTTYDDTEIATR,so,C,508,true,"S-sulfenylation site detection using YAP1C",110,32714340,,,,,,,,
ATSTTYDDTE,nt,A,509,true,"Arg/N-end rule seed, prt6 vs. Wt",99,29168982,"MASCOT Score",59.6600000,,-0.9630803,0.1624609,NO,0.0002189999941038,-2.2539379
GKPLEQAPLASSSSAPSLAAAASNATSTATEAPSVK,ph,S,602,true,"Large-scale phosphorylation discovery",44,23111157,XCorr,5.0010000,,,,,,
GKPLEQAPLASSSSAPSLAAAASNATSTATEAPSVK,ph,S,602,true,"MAPK Arabidopsis substrates",45,23172892,"MaxQuant Score",62.3930000,,,,,,
GKPLEQAPLASSSSAPSLAAAASNATSTATEAPSVK,ph,S,603,true,"Col-0 callus - FC Col-0 vs. Col-0 Xray",111a,31410901,,108.7400000,,0.3457417,0.0000000,NO,,1.3163043
GKPLEQAPLASSSSAPSLAAAASNATSTATEAPSVK,ph,S,603,true,"Col-0 X-ray callus - FC Col-0 vs. Col-0 Xray",111b,31410901,,108.7400000,,0.3457417,0.0000000,NO,,1.3163043
GKPLEQAPLASSSSAPSLAAAASNATSTATEAPSVK,ph,S,603,true,"atm callus - FC atm vs. atm Xray",111c,31410901,,108.7400000,,0.9014344,0.0000000,NO,,1.3163043
GKPLEQAPLASSSSAPSLAAAASNATSTATEAPSVK,ph,S,603,true,"atm-3 X-ray callus - FC atm vs. atm Xray",111d,31410901,,108.7400000,,0.9014344,0.0000000,NO,,1.3163043
GKPLEQAPLASSSSAPSLAAAASNATSTATEAPSVK,ph,S,605,true,"Large-scale phosphorylation discovery",44,23111157,XCorr,6.3370000,,,,,,
GKPLEQAPLASSSSAPSLAAAASNATSTATEAPSVK,ph,S,605,true,"PAMP-triggered phosphorylation",48,24601666,"MASCOT Score",89.8500000,,,,,,
GKPLEQAPLASSSSAPSLAAAASNATSTATEAPSVK,ph,S,605,true,"TOR Kinase and ABA Receptor",100,29290610,XCorr,6.6579027,0.7523000,,,,4.0969999615115E-10,
GKPLEQAPLASSSSAPSLAAAASNATSTATEAPSVK,ph,S,605,true,"Tissue atlas Arabidopsis - ProteomicsDB",114,32188942,"MaxQuant score",256.6000000,0.9421240,,,,0,
GKPLEQAPLASSSSAPSLAAAASNATSTATEAPSVK,ph,S,614,true,"Tissue atlas Arabidopsis - ProteomicsDB",114,32188942,"MaxQuant score",60.0930000,0.8324710,,,,1.0658199878222E-9,
GKPLEQAPLASSSSAPSLAAAASNATSTATEAPSVK,ph,S,625,true,"Tissue atlas Arabidopsis - ProteomicsDB",114,32188942,"MaxQuant score",128.6900000,0.9988240,,,,0,
DGWDLEPLDEPKPSPALANIQAAQK,ph,S,682,true,"Tissue atlas Arabidopsis - ProteomicsDB",114,32188942,"MaxQuant score",131.1300000,1.0000000,,,,3.5724099840955E-35,
TEDDDLWGSIAAPPPATTSRPLNVK,ph,S,729,true,"Tissue atlas Arabidopsis - ProteomicsDB",114,32188942,"MaxQuant score",96.7930000,0.9999790,,,,8.7581400183637E-17,
TVQSDDEDPWAAIAAPPPTTR,ph,T,747,true,"Large-scale phosphorylation discovery",44,23111157,XCorr,3.7530000,,,,,,
TVQSDDEDPWAAIAAPPPTTR,ph,T,747,true,"srk2dei ABA signaling phopshoproteomics",83,23572148,"MASCOT Score",40.0000000,,,,,,0.0011000
TVQSDDEDPWAAIAAPPPTTR,ph,T,747,true,"Phospho cell culture sucrose/TOR",109,30833711,,,0.8517790,,,,,
TVQSDDEDPWAAIAAPPPTTR,ph,T,747,true,"Col-0 callus - FC Col-0 vs. Col-0 Xray",111a,31410901,,40.0600000,,0.9390878,0.0000000,NO,,0.9199939
TVQSDDEDPWAAIAAPPPTTR,ph,T,747,true,"Col-0 X-ray callus - FC Col-0 vs. Col-0 Xray",111b,31410901,,40.0600000,,0.9390878,0.0000000,NO,,0.9199939
TVQSDDEDPWAAIAAPPPTTR,ph,T,747,true,"atm callus - FC atm vs. atm Xray",111c,31410901,,40.0600000,,0.7760218,0.0000000,NO,,0.9199939
TVQSDDEDPWAAIAAPPPTTR,ph,T,747,true,"atm-3 X-ray callus - FC atm vs. atm Xray",111d,31410901,,40.0600000,,0.7760218,0.0000000,NO,,0.9199939
KTVQSDDEDPWAAIAAPPPTTR,ph,S,750,true,"Tissue atlas Arabidopsis - ProteomicsDB",114,32188942,"MaxQuant score",223.7000000,0.9992770,,,,0,
TVQSDDEDPWAAIAAPPPTTR,ph,S,750,true,"Large-scale phosphorylation discovery",44,23111157,XCorr,4.0010000,,,,,,
TVQSDDEDPWAAIAAPPPTTR,ph,S,750,true,"srk2dei ABA signaling phopshoproteomics",83,23572148,"MASCOT Score",84.0000000,,,,,,-0.0006000
TVQSDDEDPWAAIAAPPPTTR,ph,S,750,true,"LAXIC - mannitol vs control",84b,23660473,XCorr,4.4300000,0.9270000,,,,6.6200002294195E-13,
TVQSDDEDPWAAIAAPPPTTR,ph,S,750,true,"SnRK2 protein kinase substrates",85,23776212,XCorr,4.0216808,0.9580000,,,,0.0061123501509428,
TVQSDDEDPWAAIAAPPPTTR,ph,S,750,true,"atm and atr DNA damage response",88,25561503,"MASCOT Score",37.0000000,0.9320000,,,,,-0.3400000
TVQSDDEDPWAAIAAPPPTTR,ph,S,750,true,"Brassinosteroid-Regulated Phosphorylation Dynamics",94,26187819,"MaxQuant Score",120.2700000,0.8610000,,,,6.376000101227E-7,0.7720000
TVQSDDEDPWAAIAAPPPTTR,ph,S,750,true,"TOR Kinase and ABA Receptor",100,29290610,XCorr,4.0000591,0.9003000,,,,4.1880000935635E-5,
TVQSDDEDPWAAIAAPPPTTR,ph,S,750,true,"Lateral root-induction - NAA vs control",106,23328941,"MASCOT Score",48.0000000,,,,,,
TVQSDDEDPWAAIAAPPPTTR,ph,S,750,true,"Phospho cell culture sucrose/TOR",109,30833711,,,0.9944840,,,,,
TVQSDDEDPWAAIAAPPPTTR,ph,S,750,true,"Col-0 callus - FC Col-0 vs. Col-0 Xray",111a,31410901,,70.6400000,,0.8444699,0.0000000,NO,,1.0543566
TVQSDDEDPWAAIAAPPPTTR,ph,S,750,true,"Col-0 X-ray callus - FC Col-0 vs. Col-0 Xray",111b,31410901,,70.6400000,,0.8444699,0.0000000,NO,,1.0543566
TVQSDDEDPWAAIAAPPPTTR,ph,S,750,true,"atm callus - FC atm vs. atm Xray",111c,31410901,,70.6400000,,1.2466479,0.0000000,NO,,1.0543566
TVQSDDEDPWAAIAAPPPTTR,ph,S,750,true,"atm-3 X-ray callus - FC atm vs. atm Xray",111d,31410901,,70.6400000,,1.2466479,0.0000000,NO,,1.0543566
TVQSDDEDPWAAIAAPPPTTR,ph,T,765,true,"Tissue atlas Arabidopsis - ProteomicsDB",114,32188942,"MaxQuant score",251.5500000,0.8397940,,,,0,
