Peptide,PTM,ModifiedAA,ModifiedPosition,PeptideUniqueToGene,ExperimentDesc,ExpID,PubmedID,ScoreType,IdentScore,LocProb,Log2FChange,PQ-val,QuantSig,PEP,MassErrorPPM
ANRTDPLAKNIR,nta,A,2,true,"Arabidopsis translation initiation landscape - NTA",167a,35069635,,,,,,,,
SVLEDDFEEEEEKEENEGIADGSEDEMDQR,ph,S,182,true,"Conserved plant phosphoproteome - Arabidopsis",61a,20466843,"MASCOT Score",81.0000000,1.0000000,,,,,
KSVLEDDFEEEEEKEENEGIADGSEDEMDQR,ph,S,204,true,"STN8 phosphoproteome",38,21768351,"MASCOT Score",62.3100000,,,,,,
KSVLEDDFEEEEEKEENEGIADGSEDEMDQR,ph,S,204,true,"SnRK2 protein kinase substrates",85,23776212,XCorr,4.7051916,1.0000000,,,,3.6580100060135E-10,
SVLEDDFEEEEEKEENEGIADGSEDEMDQR,ph,S,204,true,"Conserved plant phosphoproteome - Arabidopsis",61a,20466843,"MASCOT Score",81.0000000,1.0000000,,,,,
SVLEDDFEEEEEKEENEGIADGSEDEMDQR,ph,S,204,true,"srk2dei ABA signaling phopshoproteomics",83,23572148,"MASCOT Score",96.0000000,,,,,,-0.0026000
SVLEDDFEEEEEKEENEGIADGSEDEMDQR,ph,S,204,true,"SnRK2 protein kinase substrates",85,23776212,XCorr,4.5834098,1.0000000,,,,1.0336399806552E-14,
SVLEDDFEEEEEKEENEGIADGSEDEMDQR,ph,S,204,true,"Brassinosteroid-Regulated Phosphorylation Dynamics",94,26187819,"MaxQuant Score",125.7100000,1.0000000,,,,2.6889999760583E-18,1.6220000
SVLEDDFEEEEEKEENEGIADGSEDEMDQR,ph,S,204,true,"TOR Kinase and ABA Receptor",100,29290610,XCorr,6.7560959,1.0000000,,,,1.4950000149838E-5,
EENEGIADGSEDEMDQR,ph,S,204,true,"STN8 phosphoproteome",38,21768351,"MASCOT Score",87.8300000,,,,,,
EENEGIADGSEDEMDQR,ph,S,204,true,"Chloroplast kinase substrates",60,19376835,"MASCOT Score",85.9300000,,,,,,-1.1913500
EENEGIADGSEDEMDQR,ph,S,204,true,"srk2dei ABA signaling phopshoproteomics",83,23572148,"MASCOT Score",66.0000000,,,,,,0.0017000
EENEGIADGSEDEMDQR,ph,S,204,true,"TOR Kinase and ABA Receptor",100,29290610,XCorr,6.2582679,1.0000000,,,,1.1680000022718E-10,
