Peptide,PTM,ModifiedAA,ModifiedPosition,PeptideUniqueToGene,ExperimentDesc,ExpID,PubmedID,ScoreType,IdentScore,LocProb,Log2FChange,PQ-val,QuantSig,PEP,MassErrorPPM
GKSGNLTFSFR,nt,G,42,true,"N-terminal ChaFRADIC",92,26010716,"MASCOT Score",52.2100000,,,,,0.001390999997966,
GKSGNLTFSFR,nta,G,42,true,"N-terminal ChaFRADIC",92,26010716,"MASCOT Score",52.2100000,,,,,0.001390999997966,
ASKSSTTDALSGVVFEPFKE,nt,A,53,true,"HUNTER N-terminome: legumain, GluC and trypsin",119,31951383,"MaxQuant score",80.9800000,,,,,,
ASKSSTTDALSGVVFEPFKE,nt,A,53,true,"Arabidopsis translation initiation landscape - NT",167b,35069635,,,,,,,,
ASKSSTTDALSGVVFE,nt,A,53,true,"HUNTER N-terminome: legumain, GluC and trypsin",119,31951383,"MaxQuant score",132.5900000,,,,,,
SKSSTTDALSGVVFEPFKE,nt,S,54,true,"HUNTER N-terminome: legumain, GluC and trypsin",119,31951383,"MaxQuant score",62.9660000,,,,,,
SKSSTTDALSGVVFEPFKE,nt,S,54,true,"Arabidopsis translation initiation landscape - NT",167b,35069635,,,,,,,,
SKSSTTDALSGVVFE,nt,S,54,true,"HUNTER N-terminome: legumain, GluC and trypsin",119,31951383,"MaxQuant score",116.0100000,,,,,,
GLAKFFK,ac,K,134,false,"Quantitative Acetylproteomics",101,29440448,,,,,,,,
LVNEKLLNLHSVASK,ac,K,198,false,"Histone deacetylases substrates - hda14 vs WT",98e,29061669,"MaxQuant Score",49.6000000,1.0000000,-2.1050000,0.5942922,NO,0.0010000000474975,
SEFLTEQVE,nt,S,220,true,"N-terminal ChaFRADIC",92,26010716,"MASCOT Score",44.6900000,,,,,0.014170000329614,
