Peptide,PTM,ModifiedAA,ModifiedPosition,PeptideUniqueToGene,ExperimentDesc,ExpID,PubmedID,ScoreType,IdentScore,LocProb,Log2FChange,PQ-val,QuantSig,PEP,MassErrorPPM
ASQTPNLECR,nt,A,2,true,"Arg/N-end rule seed, prt6 vs. Wt",99,29168982,"MASCOT Score",50.5400000,,,,,0.033610001206398,-1.1450364
ASQTPNLECRMYEAKYPEV,nta,A,2,true,"Arabidopsis translation initiation landscape - NTA",167a,35069635,,,,,,,,
ASQTPNLECR,nta,A,2,true,"Characterization plant N-terminal acetylation",6,22223895,"MASCOT Score",44.5000000,,,,,,
ASQTPNLECR,nta,A,2,true,"Arg/N-end rule pathway Roots",80,25728785,"MASCOT Score",37.0600000,,,,,0.0033019999973476,
ASQTPNLECR,nta,A,2,true,"Arg/N-end rule seed, prt6 vs. Wt",99,29168982,"MASCOT Score",50.5400000,,,,,0.033610001206398,-1.1450364
ASQTPNLECR,nta,A,2,true,"FtsH12 N-terminome: WT / FtsH12 knockdown miRNA",118,33216923,"MaxQuant score",58.0730000,,,,,0.0023807000834495,
ASQTPNLECR,so,C,10,true,"S-sulfenylation site detection using YAP1C",110,32714340,,,,,,,,
SVSSLIKVGR,nt,S,62,true,"Arabidopsis translation initiation landscape - NT",167b,35069635,,,,,,,,
IRSVSSLIK,ph,S,62,true,"atm and atr DNA damage response",88,25561503,"MASCOT Score",24.0000000,1.0000000,,,,,-2.0600000
IRSVSSLIK,ph,S,62,true,"Tissue atlas Arabidopsis - ProteomicsDB",114,32188942,"MaxQuant score",106.4700000,0.9929300,,,,0.0011898200027645,
GYIDLSKR,ac,K,91,false,"Quantitative Acetylproteomics",101,29440448,,,,,,,,
RRVSEEDIQTCEER,ph,S,95,true,"atm and atr DNA damage response",88,25561503,"MASCOT Score",31.0000000,1.0000000,,,,,-0.1700000
RRVSEEDIQTCEER,ph,S,95,true,"TOR Kinase and ABA Receptor",100,29290610,XCorr,4.1697946,1.0000000,,,,0.00028760000714101,
RVSEEDIQTCEER,ph,S,95,true,"atm and atr DNA damage response",88,25561503,"MASCOT Score",56.0000000,0.9950000,,,,,0.1800000
RVSEEDIQTCEER,ph,S,95,true,"Tissue atlas Arabidopsis - ProteomicsDB",114,32188942,"MaxQuant score",66.0590000,0.9999980,,,,0.0023030699230731,
VSEEDIQTCEER,ox,C,102,true,"OxiTRAQ Arabidopsis - 5 mM H2O2 versus control",47,24376095,,,,-0.1069449,0.1101019,NO,,
RVSEEDIQTCEER,sno,C,102,true,"Site-specific nitrosomeproteomic id - gsnor1-3",90b,25699590,XCorr,2.1100000,,,,,0.00079860002733767,-5.0100000
VSEEDIQTCEER,sno,C,102,true,"Site-specific nitrosomeproteomic id - gsnor1-3",90a,25699590,XCorr,2.8025291,,,,,1.4150000424706E-5,-5.2081657
VSEEDIQTCEER,so,C,102,true,"S-sulfenylation site detection using YAP1C",110,32714340,,,,,,,,
CFQFDGVVHIK,so,C,215,true,"S-sulfenylation site detection using YAP1C",110,32714340,,,,,,,,
NAEAAGNEDCPVK,ox,C,239,true,"OxiTRAQ Arabidopsis - 5 mM H2O2 versus control",47,24376095,,,,-0.1602262,0.0871144,NO,,
NAEAAGNEDCPVK,sno,C,239,true,"Site-specific nitrosomeproteomic id - gsnor1-3",90a,25699590,XCorr,4.1981311,,,,,1.0710000424297E-5,-7.3482923
NAEAAGNEDCPVK,sno,C,239,true,"Site-specific nitrosomeproteomic id - gsnor1-3",90b,25699590,XCorr,3.8900000,,,,,0.00081120000686496,-6.8000000
NAEAAGNEDCPVK,so,C,239,true,"S-sulfenylation site detection using YAP1C",110,32714340,,,,,,,,
AIAACTETIETHK,sno,C,274,true,"Site-specific nitrosomeproteomic id - gsnor1-3",90a,25699590,XCorr,3.2858725,,,,,5.2439998398768E-5,-4.6761171
AIAACTETIETHK,sno,C,274,true,"Site-specific nitrosomeproteomic id - gsnor1-3",90b,25699590,XCorr,4.4600000,,,,,6.6980001065531E-6,-5.8700000
AIAACTETIETHK,sno,C,274,true,"hot5-4 / wildtype, FAT-switch S-nitrosoproteome",169,37277371,,,,,,,,
AIAACTETIETHK,so,C,274,true,"Arabidopsis S-sulfenylation chemoproteomics",108,31578252,"pFind PSM Score",0.0015069,,1.4391200,,,,-0.4525789
AIAACTETIETHK,so,C,274,true,"S-sulfenylation site detection using YAP1C",110,32714340,,,,,,,,
DEKMLTEHMAKLR,me1,K,300,true,"Arabidopsis protein methylome",123,31809900,"MaxQuant Score",54.2760000,1.0000000,,,,0.012908699922264,-0.3851600
DEKMLTEHMAKLR,me1,K,308,true,"Arabidopsis protein methylome",123,31809900,"MaxQuant Score",54.2760000,1.0000000,,,,0.012908699922264,-0.3851600
MLTEHMAKLR,me1,K,308,true,"Arabidopsis protein methylome",123,31809900,"MaxQuant Score",59.9080000,1.0000000,,,,0.010209700092673,-0.2947400
LDNEEMSGDEDSGDEEEDTGMGEVDLDAGAGIIE,ph,S,317,true,"SnRK2 protein kinase substrates",85,23776212,XCorr,5.3292780,1.0000000,,,,8.6788300990293E-9,
LDNEEMSGDEDSGDEEEDTGMGEVDLDAGAGIIE,ph,S,317,true,"Brassinosteroid-Regulated Phosphorylation Dynamics",94,26187819,"MaxQuant Score",54.7320000,0.9820000,,,,0.0060000000521541,-0.8470000
LDNEEMSGDEDSGDEEEDTGMGEVDLDAGAGIIE,ph,S,317,true,"TOR Kinase and ABA Receptor",100,29290610,XCorr,3.5654507,0.9985000,,,,0.0070870001800358,
LDNEEMSGDEDSGDEEEDTGMGEVDLDAGAGIIE,ph,S,322,true,"SnRK2 protein kinase substrates",85,23776212,XCorr,5.3292780,0.9990000,,,,8.6788300990293E-9,
LDNEEMSGDEDSGDEEEDTGMGEVDLDAGAGIIE,ph,S,322,true,"Brassinosteroid-Regulated Phosphorylation Dynamics",94,26187819,"MaxQuant Score",54.7320000,0.9400000,,,,0.0060000000521541,-0.8470000
LDNEEMSGDEDSGDEEEDTGMGEVDLDAGAGIIE,ph,S,322,true,"TOR Kinase and ABA Receptor",100,29290610,XCorr,3.5654507,0.9399000,,,,0.0070870001800358,
