Peptide,PTM,ModifiedAA,ModifiedPosition,PeptideUniqueToGene,ExperimentDesc,ExpID,PubmedID,ScoreType,IdentScore,LocProb,Log2FChange,PQ-val,QuantSig,PEP,MassErrorPPM
SNLCSSKTLTEVEFMR,ph,T,13,true,"Tissue atlas Arabidopsis - ProteomicsDB",114,32188942,"MaxQuant score",95.1950000,0.7919370,,,,4.9532600314706E-6,
QKSEDGASATCLLEFAACDDLSSFK,mar,E,25,true,"Noncanonical mono(ADP-ribosyl)ation of SZF protein",156,34592134,,,,,,,,
SEDGASATCLLEFAACDDLSSFKR,mar,E,25,true,"Noncanonical mono(ADP-ribosyl)ation of SZF protein",156,34592134,,,,,,,,
QKSEDGASATCLLEFAACDDLSSFK,mar,E,35,true,"Noncanonical mono(ADP-ribosyl)ation of SZF protein",156,34592134,,,,,,,,
SEDGASATCLLEFAACDDLSSFKR,mar,E,35,true,"Noncanonical mono(ADP-ribosyl)ation of SZF protein",156,34592134,,,,,,,,
SEDGASATCLLEFAACDDLSSFKR,mar,D,41,true,"Noncanonical mono(ADP-ribosyl)ation of SZF protein",156,34592134,,,,,,,,
ILLDASASPNCVDANGNKPVDLLAKDSR,mar,D,145,true,"Noncanonical mono(ADP-ribosyl)ation of SZF protein",156,34592134,,,,,,,,
ILLDASASPNCVDANGNKPVDLLAK,mar,D,145,true,"Noncanonical mono(ADP-ribosyl)ation of SZF protein",156,34592134,,,,,,,,
AVEVLLTGIHGSVMEEEEEELKSVVTK,mar,E,184,true,"Noncanonical mono(ADP-ribosyl)ation of SZF protein",156,34592134,,,,,,,,
AVEVLLTGIHGSVMEEEEEELKSVVTK,mar,E,185,true,"Noncanonical mono(ADP-ribosyl)ation of SZF protein",156,34592134,,,,,,,,
AYSHDWTECPFVHPGENAR,mar,D,232,false,"Noncanonical mono(ADP-ribosyl)ation of SZF protein",156,34592134,,,,,,,,
AYSHDWTECPFVHPGENAR,mar,E,235,false,"Noncanonical mono(ADP-ribosyl)ation of SZF protein",156,34592134,,,,,,,,
AYSHDWTECPFVHPGENAR,sno,C,236,false,"Site-specific nitrosomeproteomic id - gsnor1-3",90a,25699590,XCorr,2.6200000,,,,,0.18690000474453,-5.7700000
AYSHDWTECPFVHPGENAR,sno,C,236,false,"Site-specific nitrosomeproteomic id - gsnor1-3",90b,25699590,XCorr,3.2000000,,,,,0.00098889996297657,-2.7500000
GDSCEYAHGVFESWLHPAQYR,mar,D,272,true,"Noncanonical mono(ADP-ribosyl)ation of SZF protein",156,34592134,,,,,,,,
GDSCEYAHGVFESWLHPAQYR,mar,E,275,true,"Noncanonical mono(ADP-ribosyl)ation of SZF protein",156,34592134,,,,,,,,
RDELRPVNASTGSAMVSPR,ph,S,328,true,"atm and atr DNA damage response",88,25561503,"MASCOT Score",37.0000000,0.9770000,,,,,0.5300000
RDELRPVNASTGSAMVSPR,ph,S,328,true,"Tissue atlas Arabidopsis - ProteomicsDB",114,32188942,"MaxQuant score",157.9000000,1.0000000,,,,1.5360999944696E-22,
DELRPVNASTGSAMVSPR,ph,S,328,true,"Large-scale phosphorylation discovery",44,23111157,XCorr,2.3570000,,,,,,
DELRPVNASTGSAMVSPR,ph,S,328,true,"atm and atr DNA damage response",88,25561503,"MASCOT Score",39.0000000,1.0000000,,,,,-1.0100000
DELRPVNASTGSAMVSPR,ph,S,328,true,"TOR Kinase and ABA Receptor",100,29290610,XCorr,3.3660119,0.9999000,,,,0.0014580000424758,
VNSLTPPPLQLNGSR,ph,S,375,true,"Tissue atlas Arabidopsis - ProteomicsDB",114,32188942,"MaxQuant score",125.8900000,0.9964930,,,,2.6510599582252E-6,
VNSLTPPPLQLNGSR,ph,T,377,true,"Tissue atlas Arabidopsis - ProteomicsDB",114,32188942,"MaxQuant score",147.0700000,0.9999950,,,,3.90318000143E-8,
RLGDLKPSNLEETFGSYDSASVMQLQSPSR,ph,S,438,true,"Tissue atlas Arabidopsis - ProteomicsDB",114,32188942,"MaxQuant score",237.9100000,0.9536020,,,,0,
HSQMNHYPSSPVR,ph,S,450,true,"Tissue atlas Arabidopsis - ProteomicsDB",114,32188942,"MaxQuant score",165.0900000,0.8458690,,,,5.95025001493E-11,
HSQMNHYPSSPVR,ph,S,451,true,"atm and atr DNA damage response",88,25561503,"MASCOT Score",43.0000000,0.9940000,,,,,-0.9500000
HSQMNHYPSSPVR,ph,S,451,true,"Phospho cell culture sucrose/TOR",109,30833711,,,0.7811650,,,,,
HSQMNHYPSSPVR,ph,S,451,true,"Tissue atlas Arabidopsis - ProteomicsDB",114,32188942,"MaxQuant score",202.5200000,0.9588110,,,,1.1410599633987E-38,
QPPPHGFESSAAMAAAVMNAR,fuc,S,463,true,"SPINDLY O-fucosylation",162,36739885,,,,,,,-0.94999998807907,
RSLSFKPAPVASNVSDWGSPNGK,ph,S,485,true,"TOR Kinase and ABA Receptor",100,29290610,XCorr,4.9848194,0.8787000,,,,5.8559999160934E-7,
SLSFKPAPVASNVSDWGSPNGK,ph,S,485,true,"Tissue atlas Arabidopsis - ProteomicsDB",114,32188942,"MaxQuant score",325.2400000,0.9999850,,,,0,
SASFGIHGNNNNSVSRPAR,ph,S,522,true,"Col-0 callus - FC Col-0 vs. Col-0 Xray",111a,31410901,,23.0900000,,1.5765273,0.0000000,NO,,0.6281074
SASFGIHGNNNNSVSRPAR,ph,S,522,true,"Col-0 X-ray callus - FC Col-0 vs. Col-0 Xray",111b,31410901,,23.0900000,,1.5765273,0.0000000,NO,,0.6281074
SASFGIHGNNNNSVSRPAR,ph,S,522,true,"atm callus - FC atm vs. atm Xray",111c,31410901,,23.0900000,,2.5698456,0.0000000,NO,,0.6281074
SASFGIHGNNNNSVSRPAR,ph,S,522,true,"atm-3 X-ray callus - FC atm vs. atm Xray",111d,31410901,,23.0900000,,2.5698456,0.0000000,NO,,0.6281074
SASFGIHGNNNNSVSR,ph,S,522,true,"atm and atr DNA damage response",88,25561503,"MASCOT Score",58.0000000,0.9830000,,,,,-0.5100000
SASFGIHGNNNNSVSR,ph,S,522,true,"Phospho cell culture sucrose/TOR",109,30833711,,,0.9949590,,,,,
SASFGIHGNNNNSVSR,ph,S,522,true,"Tissue atlas Arabidopsis - ProteomicsDB",114,32188942,"MaxQuant score",190.2400000,0.9999970,,,,1.9473399840854E-35,
DYSDEPDVSWVNSLVK,mar,E,543,true,"Noncanonical mono(ADP-ribosyl)ation of SZF protein",156,34592134,,,,,,,,
