Peptide,PTM,ModifiedAA,ModifiedPosition,PeptideUniqueToGene,ExperimentDesc,ExpID,PubmedID,ScoreType,IdentScore,LocProb,Log2FChange,PQ-val,QuantSig,PEP,MassErrorPPM
FGFSFGKK,ph,S,34,true,"Tissue atlas Arabidopsis - ProteomicsDB",114,32188942,"MaxQuant score",125.5700000,1.0000000,,,,0.0022475600708276,
FGFSFGK,ph,S,34,true,"STN8 phosphoproteome",38,21768351,"MASCOT Score",47.5000000,,,,,,-0.1038440
FGFSFGK,ph,S,34,true,"Chloroplast kinase substrates",60,19376835,"MASCOT Score",30.9600000,,,,,,-4.4698200
FGFSFGK,ph,S,34,true,"TOR Kinase and ABA Receptor",100,29290610,XCorr,2.7826364,1.0000000,,,,0.00095650000730529,
FGFSFGK,ph,S,34,true,"Touch-induced phosphorylation: 40s touch vs untouc",136,30291188,"MASCOT score",41.0500000,,-0.2623196,0.2134347,NO,,7.3061172
FRECELIHGR,sno,C,140,false,"hot5-4 / wildtype, FAT-switch S-nitrosoproteome",169,37277371,,,,,,,,
ECELIHGR,sno,C,140,false,"Cold stress nitrosylation - 4°C vs 22°C",65,24388526,,,,,,,,
ECELIHGR,sno,C,140,false,"hot5-4 / wildtype, FAT-switch S-nitrosoproteome",169,37277371,,,,,,,,
NSELDPEKR,ac,K,215,true,"Quantitative Acetylproteomics",101,29440448,,,,,,,,
IYPGGYFDPLGLAADPEKLDTLK,ac,K,234,true,"Histone deacetylases - hda14 vs WT (thylakoids)",98d,29061669,"MaxQuant Score",109.4000000,1.0000000,-0.1030000,0.9571941,NO,2.4099999558829E-26,
LKLAEIK,ac,K,239,false,"Quantitative Acetylproteomics",101,29440448,,,,,,,,
LKLAEIKHSR,ac,K,244,false,"Quantitative Acetylproteomics",101,29440448,,,,,,,,
LAEIKHSR,ac,K,244,false,"Histone deacetylases - apicidin vs control",98a,29061669,"MaxQuant Score",123.2000000,1.0000000,-0.0870000,0.6966265,NO,0.00014000000373926,
LAEIKHSR,ac,K,244,false,"Histone deacetylases substrates - TSA vs control",98b,29061669,"MaxQuant Score",123.2000000,1.0000000,-0.1040000,0.9977001,NO,0.00014000000373926,
LAEIKHSR,ac,K,244,false,"Histone deacetylases - hda14 vs WT (thylakoids)",98d,29061669,"MaxQuant Score",132.8000000,1.0000000,0.0560000,0.9862795,NO,5.669999723068E-7,
LAEIKHSR,ac,K,244,false,"Quantitative Acetylproteomics",101,29440448,,,,,,,,
