Peptide,PTM,ModifiedAA,ModifiedPosition,PeptideUniqueToGene,ExperimentDesc,ExpID,PubmedID,ScoreType,IdentScore,LocProb,Log2FChange,PQ-val,QuantSig,PEP,MassErrorPPM
QNAIQLEEKEKR,ub,K,105,true,"Arabidopsis ubiquitination COFRADIC",40,26744219,"MaxQuant Score",73.4350000,0.9710000,,,,6.1840000853408E-6,0.1440000
QNAIQLEEKEKR,ub,K,107,true,"Arabidopsis ubiquitination COFRADIC",40,26744219,"MaxQuant Score",168.0200000,0.9980000,,,,0,-0.1080000
KIEVTCENNK,sno,C,135,true,"Site-specific nitrosomeproteomic id - gsnor1-3",90a,25699590,XCorr,3.4036191,,,,,0.00018600000475999,-7.2364222
KIEVTCENNK,sno,C,135,true,"Site-specific nitrosomeproteomic id - gsnor1-3",90b,25699590,XCorr,3.1000000,,,,,0.010529999621212,-7.0900000
LYLENQEKFYAESSK,me2,K,155,true,"Arabidopsis protein methylome",123,31809900,"MaxQuant Score",67.6850000,1.0000000,,,,0.0014572499785572,0.0457030
FYAESSKNYWK,ub,K,162,true,"upl3 mutant / wildtype",168,35926874,"MaxQuant score",64.1030000,1.0000000,,,,0.0012478899443522,4.3349000
EVPTIEKR,ac,K,181,true,"Quantitative Acetylproteomics",101,29440448,,,,,,,,
EVPTIEKR,ub,K,181,true,"upl3 mutant / wildtype",168,35926874,"MaxQuant score",58.4260000,1.0000000,-0.2125675,,,0.014212800189853,-0.5408800
KPTVSVIQGPK,ph,T,195,true,"SIRK1 phosphorylation",86a,23820729,"MaxQuant Score",99.1710000,1.0000000,,,,0.07599999755621,-3.0780000
KPTVSVIQGPK,ph,T,195,true,"SIRK1 exp - sirk1 mutant vs WT",86b,23820729,,,,0.1108110,,NO,,
KPTVSVIQGPK,ph,S,197,true,"SIRK1 phosphorylation",86a,23820729,"MaxQuant Score",99.1710000,1.0000000,,,,0.07599999755621,-3.0780000
KPTVSVIQGPK,ph,S,197,true,"SIRK1 exp - sirk1 mutant vs WT",86b,23820729,,,,0.1108110,,NO,,
LTSQPPSEEAAAPPK,ph,S,232,true,"Tissue atlas Arabidopsis - ProteomicsDB",114,32188942,"MaxQuant score",56.8720000,0.9833400,,,,0.0031373400706798,
