Peptide,PTM,ModifiedAA,ModifiedPosition,PeptideUniqueToGene,ExperimentDesc,ExpID,PubmedID,ScoreType,IdentScore,LocProb,Log2FChange,PQ-val,QuantSig,PEP,MassErrorPPM
ISSSGDFGIVK,ph,S,734,true,"atm and atr DNA damage response",88,25561503,"MASCOT Score",47.0000000,0.9930000,,,,,-1.0900000
SDSGGAWGIK,ph,S,1374,true,"Tissue atlas Arabidopsis - ProteomicsDB",114,32188942,"MaxQuant score",179.0800000,0.9999720,,,,1.3844000390506E-9,
DADADTTPNWETSPAPK,ph,T,1395,true,"Tissue atlas Arabidopsis - ProteomicsDB",114,32188942,"MaxQuant score",220.3400000,0.8799550,,,,0,
TKDADADTTPNWETSPAPK,ph,S,1396,true,"Tissue atlas Arabidopsis - ProteomicsDB",114,32188942,"MaxQuant score",247.0200000,0.9793950,,,,0,
DADADTTPNWETSPAPK,ph,S,1396,true,"atm and atr DNA damage response",88,25561503,"MASCOT Score",29.0000000,1.0000000,,,,,-0.1300000
NIETDSEPAAWGSQGKK,ph,S,1530,true,"Tissue atlas Arabidopsis - ProteomicsDB",114,32188942,"MaxQuant score",91.1280000,0.9999900,,,,1.3995900189911E-5,
KSETEPGPAGWGMGDKK,ub,K,1567,true,"Protein ubiquitination during photomorphogenesis",3,28461270,,,,,,,,
KNSETELGPAAMGNWDK,ph,S,1570,true,"atm and atr DNA damage response",88,25561503,"MASCOT Score",80.0000000,1.0000000,,,,,-0.5400000
KNSETELGPAAMGNWDK,ph,S,1570,true,"Tissue atlas Arabidopsis - ProteomicsDB",114,32188942,"MaxQuant score",258.3700000,0.9999210,,,,0,
NNSETESDAAAWGSR,ph,S,1612,true,"Tissue atlas Arabidopsis - ProteomicsDB",114,32188942,"MaxQuant score",80.5220000,0.9980910,,,,0.00024650600971654,
TSEIESGAGAWGSWGQPSPTAEDKDTNEDDRNPWVSLK,ph,S,1645,true,"Tissue atlas Arabidopsis - ProteomicsDB",114,32188942,"MaxQuant score",117.8300000,0.8001590,,,,1.4012984643248E-44,
