Peptide,PTM,ModifiedAA,ModifiedPosition,PeptideUniqueToGene,ExperimentDesc,ExpID,PubmedID,ScoreType,IdentScore,LocProb,Log2FChange,PQ-val,QuantSig,PEP,MassErrorPPM
AATSEHTILQFVSPSSTASATTSVLTAR,nt,A,2,true,"FtsH12 N-terminome: WT / FtsH12 knockdown miRNA",118,33216923,"MaxQuant score",70.2810000,,1.1171144,0.0161877,YES,0.017243999987841,
AATSEHTILQF,nt,A,2,true,"Arg/N-end rule seed, prt6 vs. Wt",99,29168982,"MASCOT Score",36.4600000,,,,,0.064589999616146,-0.0411131
AATSEHTIL,nt,A,2,true,"Arg/N-end rule seed, prt6 vs. Wt",99,29168982,"MASCOT Score",32.3400000,,,,,0.17080000042915,-0.4389625
AATSEHTILQFVSPSSTASATTSVLTAR,nta,A,2,true,"Characterization plant N-terminal acetylation",6,22223895,"MASCOT Score",83.7600000,,,,,,
AATSEHTILQFVSPSSTASATTSVLTAR,nta,A,2,true,"Arg/N-end rule pathway Roots",80,25728785,"MASCOT Score",42.9800000,,,,,0.0003009999927599,
AATSEHTILQFVSPSSTASATTSVLTAR,nta,A,2,true,"HUNTER N-terminome: legumain, GluC and trypsin",119,31951383,"MaxQuant score",234.3700000,,,,,,
AATSEHTILQFVSPSSTASATTSVLTAR,nta,A,2,true,"Arabidopsis translation initiation landscape - NTA",167a,35069635,,,,,,,,
AATSEHTILQF,nta,A,2,true,"Arg/N-end rule seed, prt6 vs. Wt",99,29168982,"MASCOT Score",36.4600000,,,,,0.064589999616146,-0.0411131
AATSEHTIL,nta,A,2,true,"Arg/N-end rule seed, prt6 vs. Wt",99,29168982,"MASCOT Score",32.3400000,,,,,0.17080000042915,-0.4389625
SILPDGTVDIR,nt,S,59,true,"Arg/N-end rule seed, prt6 vs. Wt",99,29168982,"MASCOT Score",53.0700000,,0.1266239,0.7915908,NO,0.024280000478029,-3.0360541
SILPDGTVDIR,nt,S,59,true,"FtsH12 N-terminome: WT / FtsH12 knockdown miRNA",118,33216923,"MaxQuant score",134.1300000,,-0.0440900,0.7894447,NO,0,
QLVAHFQEIPVDLR,nt,Q,164,true,"HUNTER N-terminome: legumain, GluC and trypsin",119,31951383,"MaxQuant score",106.4900000,,,,,,
