Peptide,PTM,ModifiedAA,ModifiedPosition,PeptideUniqueToGene,ExperimentDesc,ExpID,PubmedID,ScoreType,IdentScore,LocProb,Log2FChange,PQ-val,QuantSig,PEP,MassErrorPPM
TTPITGKNSPVTGK,ph,S,10,true,"Tissue atlas Arabidopsis - ProteomicsDB",114,32188942,"MaxQuant score",153.0300000,0.9998830,,,,1.5857500201832E-8,
SPLTEHISANTNIQR,ph,S,36,true,"atm and atr DNA damage response",88,25561503,"MASCOT Score",47.0000000,1.0000000,,,,,0.5600000
SPLTEHISANTNIQR,ph,S,36,true,"Col-0 callus - FC Col-0 vs. Col-0 Xray",111a,31410901,,38.6300000,,-0.2693664,0.0000000,NO,,0.9376584
SPLTEHISANTNIQR,ph,S,36,true,"Col-0 X-ray callus - FC Col-0 vs. Col-0 Xray",111b,31410901,,38.6300000,,-0.2693664,0.0000000,NO,,0.9376584
SPLTEHISANTNIQR,ph,S,36,true,"atm callus - FC atm vs. atm Xray",111c,31410901,,38.6300000,,0.4587143,0.0000000,NO,,0.9376584
SPLTEHISANTNIQR,ph,S,36,true,"atm-3 X-ray callus - FC atm vs. atm Xray",111d,31410901,,38.6300000,,0.4587143,0.0000000,NO,,0.9376584
SPLTEHISANTNIQR,ph,S,36,true,"Tissue atlas Arabidopsis - ProteomicsDB",114,32188942,"MaxQuant score",196.5200000,0.9999940,,,,2.1148801001999E-34,
TQTSKIQPK,ph,T,120,true,"srk2dei ABA signaling phopshoproteomics",83,23572148,"MASCOT Score",22.0000000,,,,,,0.0032000
TQTSKIQPK,ph,T,122,true,"srk2dei ABA signaling phopshoproteomics",83,23572148,"MASCOT Score",22.0000000,,,,,,0.0032000
GTISGNRNPSTFSQTK,ph,S,132,true,"Tissue atlas Arabidopsis - ProteomicsDB",114,32188942,"MaxQuant score",102.8400000,0.9997780,,,,7.4026797847182E-6,
SVSSEQLLK,ph,S,369,true,"atm and atr DNA damage response",88,25561503,"MASCOT Score",54.0000000,0.9490000,,,,,-0.5500000
SVSSEQLLK,ph,S,369,true,"Tissue atlas Arabidopsis - ProteomicsDB",114,32188942,"MaxQuant score",152.6900000,0.9931320,,,,0.0001117490028264,
TDIAQHSQLESNHK,ph,S,529,true,"Tissue atlas Arabidopsis - ProteomicsDB",114,32188942,"MaxQuant score",64.2140000,0.8937600,,,,0.00066267501097172,
SGQNLGYSDLGASTSDGLPCGNK,ph,S,552,true,"Tissue atlas Arabidopsis - ProteomicsDB",114,32188942,"MaxQuant score",259.6000000,1.0000000,,,,0,
SGQNLGYSDLGASTSDGLPCGNK,ph,S,566,true,"Tissue atlas Arabidopsis - ProteomicsDB",114,32188942,"MaxQuant score",213.1400000,0.7760950,,,,0,
LCSPSSDANILPDDESFPVDHESTEGNPGHQK,ph,S,582,true,"Tissue atlas Arabidopsis - ProteomicsDB",114,32188942,"MaxQuant score",150.6300000,0.9932930,,,,0,
DFGSEGTQR,ph,S,666,true,"atm and atr DNA damage response",88,25561503,"MASCOT Score",48.0000000,0.9950000,,,,,-0.4300000
DFGSEGTQR,ph,S,666,true,"Tissue atlas Arabidopsis - ProteomicsDB",114,32188942,"MaxQuant score",84.1980000,0.9980200,,,,0.0032874199096113,
DNGSPFSEIYLHNDSLEPGANK,ph,S,675,true,"Tissue atlas Arabidopsis - ProteomicsDB",114,32188942,"MaxQuant score",228.0000000,1.0000000,,,,0,
LQGSPSEAPVER,ph,S,697,true,"SnRK2 protein kinase substrates",85,23776212,XCorr,2.4587481,0.9870000,,,,0.013259099796414,
LQGSPSEAPVER,ph,S,697,true,"atm and atr DNA damage response",88,25561503,"MASCOT Score",53.0000000,1.0000000,,,,,1.0900000
LQGSPSEAPVER,ph,S,697,true,"TOR Kinase and ABA Receptor",100,29290610,XCorr,3.5047092,0.9919000,,,,1.6300000424962E-5,
LQGSPSEAPVER,ph,S,697,true,"Lateral root-induction - NAA vs control",106,23328941,"MASCOT Score",43.0000000,,,,,,
LQGSPSEAPVER,ph,S,697,true,"Phospho cell culture sucrose/TOR",109,30833711,,,0.9999650,,,,,
LQGSPSEAPVER,ph,S,697,true,"Col-0 callus - FC Col-0 vs. Col-0 Xray",111a,31410901,,44.3100000,,-0.4748093,0.0000000,NO,,0.6618237
LQGSPSEAPVER,ph,S,697,true,"Col-0 X-ray callus - FC Col-0 vs. Col-0 Xray",111b,31410901,,44.3100000,,-0.4748093,0.0000000,NO,,0.6618237
LQGSPSEAPVER,ph,S,697,true,"atm callus - FC atm vs. atm Xray",111c,31410901,,44.3100000,,-0.5491582,0.0000000,NO,,0.6618237
LQGSPSEAPVER,ph,S,697,true,"atm-3 X-ray callus - FC atm vs. atm Xray",111d,31410901,,44.3100000,,-0.5491582,0.0000000,NO,,0.6618237
LQGSPSEAPVER,ph,S,697,true,"Tissue atlas Arabidopsis - ProteomicsDB",114,32188942,"MaxQuant score",203.7600000,0.9999980,,,,1.0250499758662E-30,
LQGSPSEAPVER,ph,S,699,true,"atm and atr DNA damage response",88,25561503,"MASCOT Score",53.0000000,1.0000000,,,,,1.0900000
SVEHGTNNGIQK,ph,T,1160,true,"Brassinosteroid-Regulated Phosphorylation Dynamics",94,26187819,"MaxQuant Score",88.0750000,1.0000000,,,,0.035999998450279,-1.0140000
