Peptide,PTM,ModifiedAA,ModifiedPosition,PeptideUniqueToGene,ExperimentDesc,ExpID,PubmedID,ScoreType,IdentScore,LocProb,Log2FChange,PQ-val,QuantSig,PEP,MassErrorPPM
NYNDSAAFQAER,ph,S,665,true,"Tissue atlas Arabidopsis - ProteomicsDB",114,32188942,"MaxQuant score",91.6200000,0.9999930,,,,0.00033318399800919,
NYNDSAAFQAERDSSAGR,ph,S,674,true,"atm and atr DNA damage response",88,25561503,"MASCOT Score",26.0000000,0.9920000,,,,,0.2300000
NYNDSAAFQAERDSSAGR,ph,S,674,true,"Tissue atlas Arabidopsis - ProteomicsDB",114,32188942,"MaxQuant score",123.6400000,0.9375040,,,,2.7263300395475E-14,
GFQEPSSPK,ph,S,685,true,"Phytohormone-responsive phosphoproteins",34,20374526,"MASCOT Score",49.0000000,,,,,,6.6619100
GFQEPSSPK,ph,S,685,true,"STN8 phosphoproteome",38,21768351,"MASCOT Score",40.6300000,,,,,,0.2124150
GFQEPSSPK,ph,S,685,true,"Tyrosine phosphorylation in Arabidopsis",59,18463617,"MASCOT Score",26.0000000,,,,,,0.2842436
GFQEPSSPK,ph,S,685,true,"Chloroplast kinase substrates",60,19376835,"MASCOT Score",36.9800000,,,,,,-0.3928160
GFQEPSSPK,ph,S,685,true,"atm and atr DNA damage response",88,25561503,"MASCOT Score",37.0000000,0.9470000,,,,,-1.1600000
GFQEPSSPK,ph,S,685,true,"TOR Kinase and ABA Receptor",100,29290610,XCorr,2.0394075,0.9218000,,,,0.0095100002363324,
GFQEPSSPK,ph,S,685,true,"Phospho cell culture sucrose/TOR",109,30833711,,,0.9955690,,,,,
GFQEPSSPK,ph,S,685,true,"Tissue atlas Arabidopsis - ProteomicsDB",114,32188942,"MaxQuant score",156.5800000,0.9726260,,,,8.9405402832199E-5,
MAKSPSLQR,ph,S,691,true,"Phospho cell culture sucrose/TOR",109,30833711,,,0.9826560,,,,,
MAKSPSLQR,ph,S,691,true,"Tissue atlas Arabidopsis - ProteomicsDB",114,32188942,"MaxQuant score",167.8400000,1.0000000,,,,2.3423299353453E-5,
MAKSPSLQR,ph,S,693,true,"Tissue atlas Arabidopsis - ProteomicsDB",114,32188942,"MaxQuant score",65.8420000,1.0000000,,,,0.012237300164998,
SQELCFNSEESPNDHSPAPEK,ph,S,703,true,"Tissue atlas Arabidopsis - ProteomicsDB",114,32188942,"MaxQuant score",162.4700000,0.9999990,,,,1.5613299648978E-30,
SQELCFNSEESPNDHSPAPEK,ph,S,713,true,"Tissue atlas Arabidopsis - ProteomicsDB",114,32188942,"MaxQuant score",299.6200000,0.9999640,,,,0,
SQELCFNSEESPNDHSPAPEK,ph,S,718,true,"Tissue atlas Arabidopsis - ProteomicsDB",114,32188942,"MaxQuant score",258.8300000,1.0000000,,,,0,
RQDSFEMRLPELPK,ph,S,745,true,"Phosphoproteome ethylene-regulated time response",46,24043427,"MASCOT Score",32.6700000,,,,,,-2.1049000
RQDSFEMRLPELPK,ph,S,745,true,"Tissue atlas Arabidopsis - ProteomicsDB",114,32188942,"MaxQuant score",152.7000000,1.0000000,,,,4.3005700717913E-5,
RQDSFEMR,ph,S,745,false,"Phosphorylation Early Elicitor Signaling",23,17317660,,,,,,,,
RQDSFEMR,ph,S,745,false,"Sucrose-induced phosphorylation",24,17586839,,,,,,,,
RQDSFEMR,ph,S,745,false,"Tyrosine phosphorylation in Arabidopsis",59,18463617,"MASCOT Score",50.0000000,,,,,,-0.2614498
RQDSFEMR,ph,S,745,false,"srk2dei ABA signaling phopshoproteomics",83,23572148,"MASCOT Score",59.0000000,,,,,,-0.0007000
RQDSFEMR,ph,S,745,false,"atm and atr DNA damage response",88,25561503,"MASCOT Score",35.0000000,1.0000000,,,,,-0.5400000
RQDSFEMR,ph,S,745,false,"TOR Kinase and ABA Receptor",100,29290610,XCorr,3.1605198,1.0000000,,,,0.0031220000237226,
RQDSFEMR,ph,S,745,false,"Phospho cell culture sucrose/TOR",109,30833711,,,1.0000000,,,,,
QDSFEMR,ph,S,745,false,"Phosphorylation Early Elicitor Signaling",23,17317660,,,,,,,,
SNGSDPESPISPLLISDPQNER,ph,S,769,true,"atm and atr DNA damage response",88,25561503,"MASCOT Score",25.0000000,0.9350000,,,,,0.1200000
SNGSDPESPISPLLISDPQNER,ph,S,773,true,"atm and atr DNA damage response",88,25561503,"MASCOT Score",25.0000000,1.0000000,,,,,0.1200000
SNGSDPESPISPLLISDPQNER,ph,S,773,true,"Tissue atlas Arabidopsis - ProteomicsDB",114,32188942,"MaxQuant score",232.5700000,0.9999820,,,,0,
SHSQTFSR,ph,S,788,false,"atm and atr DNA damage response",88,25561503,"MASCOT Score",24.0000000,0.9940000,,,,,-0.0200000
SHSQTFSRPLGHSDDTSASVK,ph,S,790,true,"TOR Kinase and ABA Receptor",100,29290610,XCorr,3.3089468,0.9322000,,,,0.0010430000256747,
SHSQTFSRPLGHSDDTSASVK,ph,S,790,true,"Phospho cell culture sucrose/TOR",109,30833711,,,0.9410860,,,,,
SHSQTFSRPLGHSDDTSASVK,ph,S,790,true,"Tissue atlas Arabidopsis - ProteomicsDB",114,32188942,"MaxQuant score",244.7400000,0.9994050,,,,0,
SHSQTFSRPLGHSDDTSASVK,ph,S,794,true,"Tissue atlas Arabidopsis - ProteomicsDB",114,32188942,"MaxQuant score",252.6600000,0.9989710,,,,0,
IVEEGTHDCLAGK,sno,C,1381,true,"hot5-4 / wildtype, FAT-switch S-nitrosoproteome",169,37277371,,,,,,,,
