Peptide,PTM,ModifiedAA,ModifiedPosition,PeptideUniqueToGene,ExperimentDesc,ExpID,PubmedID,ScoreType,IdentScore,LocProb,Log2FChange,PQ-val,QuantSig,PEP,MassErrorPPM
GVCENDSEDEFYDAER,ph,S,179,true,"Tyrosine phosphorylation in Arabidopsis",59,18463617,"MASCOT Score",77.0000000,,,,,,-0.8938807
GVCENDSEDEFYDAER,ph,S,179,true,"SnRK2 protein kinase substrates",85,23776212,XCorr,3.4503701,1.0000000,,,,3.3898299722779E-9,
GVCENDSEDEFYDAER,ph,S,179,true,"atm and atr DNA damage response",88,25561503,"MASCOT Score",33.0000000,1.0000000,,,,,0.0200000
ARHNPSVGY,nt,A,327,false,"Arabidopsis translation initiation landscape - NT",167b,35069635,,,,,,,,
ASLSNGSLSR,ph,S,554,false,"Tissue atlas Arabidopsis - ProteomicsDB",114,32188942,"MaxQuant score",89.1330000,0.9934920,,,,0.0014161700382829,
ASLSNGSLSR,ph,S,557,false,"Lateral root-induction - NAA vs control",106,23328941,"MASCOT Score",53.0000000,,,,,,
ASLSNGSLSR,ph,S,557,false,"Tissue atlas Arabidopsis - ProteomicsDB",114,32188942,"MaxQuant score",132.6200000,0.9340900,,,,2.3171700377134E-5,
ASLSNGSLSR,ph,S,559,false,"atm and atr DNA damage response",88,25561503,"MASCOT Score",56.0000000,0.9970000,,,,,0.2900000
ASLSNGSLSR,ph,S,559,false,"Lateral root-induction - NAA vs control",106,23328941,"MASCOT Score",34.0000000,,,,,,
ASLSNGSLSR,ph,S,559,false,"Tissue atlas Arabidopsis - ProteomicsDB",114,32188942,"MaxQuant score",210.4400000,0.9752800,,,,6.3971402076724E-20,
QDLPVMVSP,ph,S,748,true,"atm and atr DNA damage response",88,25561503,"MASCOT Score",37.0000000,1.0000000,,,,,-0.6500000
