Peptide,PTM,ModifiedAA,ModifiedPosition,PeptideUniqueToGene,ExperimentDesc,ExpID,PubmedID,ScoreType,IdentScore,LocProb,Log2FChange,PQ-val,QuantSig,PEP,MassErrorPPM
TKVYGTGTYDFKR,nt,T,2,true,"Arabidopsis translation initiation landscape - NT",167b,35069635,,,,,,,,
TKVYGTGTYDFKR,ac,K,13,true,"Quantitative Acetylproteomics",101,29440448,,,,,,,,
VYGTGTYDFKR,ac,K,13,true,"Quantitative Acetylproteomics",101,29440448,,,,,,,,
IAEESWIKTGGK,ph,S,62,true,"srk2dei ABA signaling phopshoproteomics",83,23572148,"MASCOT Score",24.0000000,,,,,,-0.0032000
IAEESWIKTGGK,ph,T,66,true,"srk2dei ABA signaling phopshoproteomics",83,23572148,"MASCOT Score",24.0000000,,,,,,-0.0032000
FQMELCLQPDLIKK,so,C,223,true,"S-sulfenylation site detection using YAP1C",110,32714340,,,,,,,,
LQDLSLANIGSIHK,ph,S,405,true,"Tissue atlas Arabidopsis - ProteomicsDB",114,32188942,"MaxQuant score",177.6000000,1.0000000,,,,1.6285300289372E-16,
RLSVLSLEDLR,ph,S,417,true,"Tissue atlas Arabidopsis - ProteomicsDB",114,32188942,"MaxQuant score",103.1700000,0.9998600,,,,4.7835099394433E-5,
ISEVNPADNVNMVDASPKEK,ph,S,836,true,"Tissue atlas Arabidopsis - ProteomicsDB",114,32188942,"MaxQuant score",186.8300000,1.0000000,,,,6.196440108607E-36,
IVAMTCTHAALK,so,C,1100,true,"Arabidopsis S-sulfenylation chemoproteomics",108,31578252,"pFind PSM Score",0.0017069,,1.1613500,,,,-1.4348817
NMQQLNQSPDIDGELSK,ph,S,1477,true,"Arabidopsis root NAA phosphoproteome",18a,27643528,"MaxQuant Score",111.4000000,1.0000000,,,,7.9200002553111E-17,0.2100000
NMQQLNQSPDIDGELSK,ph,S,1477,true,"Phosphorylation Early Elicitor Signaling",23,17317660,,,,,,,,
NMQQLNQSPDIDGELSK,ph,S,1477,true,"Phosphorylation nuclei-enriched fractions",28,19245862,,,,,,,,
NMQQLNQSPDIDGELSK,ph,S,1477,true,"STN8 phosphoproteome",38,21768351,"MASCOT Score",94.8200000,,,,,,-1.1213800
NMQQLNQSPDIDGELSK,ph,S,1477,true,"PAMP-triggered phosphorylation",48,24601666,"MASCOT Score",71.3800000,,,,,,
NMQQLNQSPDIDGELSK,ph,S,1477,true,"Tyrosine phosphorylation in Arabidopsis",59,18463617,"MASCOT Score",99.0000000,,,,,,-1.1523863
NMQQLNQSPDIDGELSK,ph,S,1477,true,"Chloroplast kinase substrates",60,19376835,"MASCOT Score",87.8000000,,,,,,-0.3204690
NMQQLNQSPDIDGELSK,ph,S,1477,true,"BSK8 and BSL2 regulating sucrose-ph synthase",66,24924143,"MaxQuant Score",211.8700000,,,,,,-0.3142700
NMQQLNQSPDIDGELSK,ph,S,1477,true,"srk2dei ABA signaling phopshoproteomics",83,23572148,"MASCOT Score",95.0000000,,,,,,-0.0003000
NMQQLNQSPDIDGELSK,ph,S,1477,true,"LAXIC - ABA stress",84a,23660473,XCorr,5.4400000,1.0000000,,,,5.0499999737497E-9,
NMQQLNQSPDIDGELSK,ph,S,1477,true,"LAXIC - mannitol vs control",84b,23660473,XCorr,5.3600000,1.0000000,-1.0894761,,NO,4.3000000791257E-16,
NMQQLNQSPDIDGELSK,ph,S,1477,true,"SnRK2 protein kinase substrates",85,23776212,XCorr,4.6342859,1.0000000,,,,1.1582499716278E-11,
NMQQLNQSPDIDGELSK,ph,S,1477,true,"atm and atr DNA damage response",88,25561503,"MASCOT Score",62.0000000,1.0000000,,,,,0.5800000
NMQQLNQSPDIDGELSK,ph,S,1477,true,"Brassinosteroid-Regulated Phosphorylation Dynamics",94,26187819,"MaxQuant Score",175.3300000,1.0000000,,,,1.1379999601624E-31,-4.8410000
NMQQLNQSPDIDGELSK,ph,S,1477,true,"TOR Kinase and ABA Receptor",100,29290610,XCorr,5.6623144,1.0000000,,,,2.6180001100329E-7,
NMQQLNQSPDIDGELSK,ph,S,1477,true,"Lateral root-induction - NAA vs control",106,23328941,"MASCOT Score",71.0000000,,0.0030465,0.9342784,NO,,
NMQQLNQSPDIDGELSK,ph,S,1477,true,"Phospho cell culture sucrose/TOR",109,30833711,,,1.0000000,,,,,
NMQQLNQSPDIDGELSK,ph,S,1477,true,"Col-0 callus - FC Col-0 vs. Col-0 Xray",111a,31410901,,82.6900000,,0.6761380,0.0000000,NO,,1.1949340
NMQQLNQSPDIDGELSK,ph,S,1477,true,"Col-0 X-ray callus - FC Col-0 vs. Col-0 Xray",111b,31410901,,82.6900000,,0.6761380,0.0000000,NO,,1.1949340
NMQQLNQSPDIDGELSK,ph,S,1477,true,"atm callus - FC atm vs. atm Xray",111c,31410901,,82.6900000,,1.7880546,0.0000000,NO,,1.1949340
NMQQLNQSPDIDGELSK,ph,S,1477,true,"atm-3 X-ray callus - FC atm vs. atm Xray",111d,31410901,,82.6900000,,1.7880546,0.0000000,NO,,1.1949340
NMQQLNQSPDIDGELSK,ph,S,1477,true,"Tissue atlas Arabidopsis - ProteomicsDB",114,32188942,"MaxQuant score",394.1200000,1.0000000,,,,0,
