Peptide,PTM,ModifiedAA,ModifiedPosition,PeptideUniqueToGene,ExperimentDesc,ExpID,PubmedID,ScoreType,IdentScore,LocProb,Log2FChange,PQ-val,QuantSig,PEP,MassErrorPPM
KASKSFFVEDEER,ph,S,46,true,"Ethylene-regulated phosphorylation ein2 mutant",30,19253305,"MASCOT Score",65.3333000,,,,,,-6.8772880
KASKSFFVEDEER,ph,S,46,true,"Tissue atlas Arabidopsis - ProteomicsDB",114,32188942,"MaxQuant score",87.0880000,1.0000000,,,,0.0038286799099296,
ASKSFFVEDEER,ac,K,47,true,"Quantitative Acetylproteomics",101,29440448,,,,,,,,
SFFVEDEERAFEK,ph,S,48,true,"TOR Kinase and ABA Receptor",100,29290610,XCorr,3.6445000,1.0000000,,,,7.8800003393553E-5,
ASKSFFVEDEER,ph,S,48,true,"atm and atr DNA damage response",88,25561503,"MASCOT Score",53.0000000,1.0000000,,,,,-0.1800000
SFFVEDEER,ph,S,48,true,"Arabidopsis root NAA phosphoproteome",18a,27643528,"MaxQuant Score",57.1750000,1.0000000,,,,0.00042719999328256,0.2630000
SFFVEDEER,ph,S,48,true,"atm and atr DNA damage response",88,25561503,"MASCOT Score",65.0000000,1.0000000,,,,,0.1800000
SFFVEDEER,ph,S,48,true,"TOR Kinase and ABA Receptor",100,29290610,XCorr,2.6669514,1.0000000,,,,0.0013839999446645,
SFFVEDEER,ph,S,48,true,"Tissue atlas Arabidopsis - ProteomicsDB",114,32188942,"MaxQuant score",100.6900000,1.0000000,,,,0.0011252199765295,
CHDHFVR,sno,C,61,true,"hot5-4 / wildtype, FAT-switch S-nitrosoproteome",169,37277371,,,,,,,,
SAEDLLGAR,nt,S,117,true,"N-terminal ChaFRADIC",92,26010716,"MASCOT Score",20.4100000,,,,,0.0020540000405163,
SAEDLLGAR,nt,S,117,true,"Arg/N-end rule seed, prt6 vs. Wt",99,29168982,"MASCOT Score",46.1800000,,-0.3357675,0.0325021,NO,0.013260000385344,-1.5231943
PALYFSKILDASLNK,ub,K,248,true,"upl3 mutant / wildtype",168,35926874,"MaxQuant score",116.6300000,1.0000000,0.0908534,0.9355000,NO,9.6262198212571E-9,0.3597600
