Peptide,PTM,ModifiedAA,ModifiedPosition,PeptideUniqueToGene,ExperimentDesc,ExpID,PubmedID,ScoreType,IdentScore,LocProb,Log2FChange,PQ-val,QuantSig,PEP,MassErrorPPM
SGLYNNSSYFSPAR,nt,S,2,true,"Arg/N-end rule seed, prt6 vs. Wt",99,29168982,"MASCOT Score",100.2300000,,,,,9.3060004147105E-9,-2.0924888
SGLYNNSSYFSPAR,nta,S,2,true,"Characterization plant N-terminal acetylation",6,22223895,"MASCOT Score",54.9500000,,,,,,
SGLYNNSSYFSPAR,nta,S,2,true,"Arg/N-end rule seed, prt6 vs. Wt",99,29168982,"MASCOT Score",100.2300000,,,,,9.3060004147105E-9,-2.0924888
SGLYNNSSYFSPAR,nta,S,2,true,"HUNTER N-terminome: legumain, GluC and trypsin",119,31951383,"MaxQuant score",114.7200000,,,,,,
SGLYNNSSYFSPAR,nta,S,2,true,"Arabidopsis translation initiation landscape - NTA",167a,35069635,,,,,,,,
SGLYNNSSYFSPAR,ph,S,12,true,"atm and atr DNA damage response",88,25561503,"MASCOT Score",60.0000000,1.0000000,,,,,-0.6300000
SGLYNNSSYFSPAR,ph,S,12,true,"Phospho cell culture sucrose/TOR",109,30833711,,,0.9998960,,,,,
SGLYNNSSYFSPAR,ph,S,12,true,"Tissue atlas Arabidopsis - ProteomicsDB",114,32188942,"MaxQuant score",292.6300000,0.9999970,,,,0,
AASPQIRSTPEIDSSQYLTELLAEHQK,ph,S,18,true,"TOR Kinase and ABA Receptor",100,29290610,XCorr,3.7877722,0.9129000,,,,0.00063939997926354,
AASPQIR,ph,S,18,false,"TOR Kinase and ABA Receptor",100,29290610,XCorr,2.0750480,1.0000000,,,,0.0042840000241995,
AASPQIR,ph,S,18,false,"Lateral root-induction - NAA vs control",106,23328941,"MASCOT Score",28.0000000,,,,,,
AASPQIR,ph,S,18,false,"Col-0 callus - FC Col-0 vs. Col-0 Xray",111a,31410901,,41.8300000,,-1.4380172,0.0000000,NO,,0.0357604
AASPQIR,ph,S,18,false,"Col-0 X-ray callus - FC Col-0 vs. Col-0 Xray",111b,31410901,,41.8300000,,-1.4380172,0.0000000,NO,,0.0357604
AASPQIR,ph,S,18,false,"atm callus - FC atm vs. atm Xray",111c,31410901,,41.8300000,,-1.4642386,0.0000000,NO,,0.0357604
AASPQIR,ph,S,18,false,"atm-3 X-ray callus - FC atm vs. atm Xray",111d,31410901,,41.8300000,,-1.4642386,0.0000000,NO,,0.0357604
STPEIDSSQYLTELLAEHQK,ph,T,24,true,"Tissue atlas Arabidopsis - ProteomicsDB",114,32188942,"MaxQuant score",287.2500000,0.9800220,,,,0,
SPSPMASSNLMSNVSNTGLGGWNGLSQER,og,S,83,true,"O-GlcNac Inflorescence Tissue",81,28154133,"MASCOT Score",21.5000000,,,,,,-9.2000000
HRSPSPMASSNLMSNVSNTGLGGWNGLSQER,ph,S,83,true,"TOR Kinase and ABA Receptor",100,29290610,XCorr,5.3181329,0.8541000,,,,7.3010000960494E-6,
HRSPSPMASSNLMSNVSNTGLGGWNGLSQER,ph,S,83,true,"Tissue atlas Arabidopsis - ProteomicsDB",114,32188942,"MaxQuant score",221.7700000,0.9999560,,,,0,
SPSPMASSNLMSNVSNTGLGGWNGLSQER,og,S,85,true,"O-GlcNac Inflorescence Tissue",81,28154133,"MASCOT Score",21.5000000,,,,,,-9.2000000
HRSPSPMASSNLMSNVSNTGLGGWNGLSQER,ph,S,85,true,"Tissue atlas Arabidopsis - ProteomicsDB",114,32188942,"MaxQuant score",219.1600000,0.9972900,,,,0,
HRSPSPMASSNLMSNVSNTGLGGWNGLSQER,ph,S,94,true,"TOR Kinase and ABA Receptor",100,29290610,XCorr,5.6512547,0.9559000,,,,1.1539999604793E-6,
LSGTPGMTMDWQGAPGSPSSYTVK,ph,S,128,true,"LAXIC - ABA stress",84a,23660473,XCorr,3.2400000,0.8980000,,,,2.4199999781871E-9,
LSGTPGMTMDWQGAPGSPSSYTVK,ph,S,128,true,"TOR Kinase and ABA Receptor",100,29290610,XCorr,4.4798517,0.9704000,,,,2.8770000426448E-5,
LSGTPGMTMDWQGAPGSPSSYTVK,ph,S,128,true,"Lateral root-induction - NAA vs control",106,23328941,"MASCOT Score",28.0000000,,,,,,
LSGTPGMTMDWQGAPGSPSSYTVK,ph,S,128,true,"Phospho cell culture sucrose/TOR",109,30833711,,,0.8068050,,,,,
LSGTPGMTMDWQGAPGSPSSYTVK,ph,S,128,true,"Tissue atlas Arabidopsis - ProteomicsDB",114,32188942,"MaxQuant score",368.5900000,0.9996920,,,,0,
ELALLNSNNLREESPGPSGGGSVSPFNSSGK,ph,S,256,true,"srk2dei ABA signaling phopshoproteomics",83,23572148,"MASCOT Score",33.0000000,,,,,,0.0009000
ELALLNSNNLREESPGPSGGGSVSPFNSSGK,ph,S,263,true,"srk2dei ABA signaling phopshoproteomics",83,23572148,"MASCOT Score",62.0000000,,,,,,-0.0039000
ELALLNSNNLREESPGPSGGGSVSPFNSSGK,ph,S,263,true,"SnRK2 protein kinase substrates",85,23776212,XCorr,4.5581536,0.9050000,,,,0.0084024798125029,
ELALLNSNNLREESPGPSGGGSVSPFNSSGK,ph,S,263,true,"TOR Kinase and ABA Receptor",100,29290610,XCorr,5.8778753,0.9784000,,,,2.4060000214376E-6,
EESPGPSGGGSVSPFNSSGK,ph,S,263,true,"STN8 phosphoproteome",38,21768351,"MASCOT Score",43.8900000,,,,,,
EESPGPSGGGSVSPFNSSGK,ph,S,263,true,"Large-scale phosphorylation discovery",44,23111157,XCorr,4.8440000,,,,,,
EESPGPSGGGSVSPFNSSGK,ph,S,263,true,"Chloroplast kinase substrates",60,19376835,"MASCOT Score",71.9200000,,,,,,-1.1864300
EESPGPSGGGSVSPFNSSGK,ph,S,263,true,"srk2dei ABA signaling phopshoproteomics",83,23572148,"MASCOT Score",49.0000000,,,,,,0.0004000
EESPGPSGGGSVSPFNSSGK,ph,S,263,true,"LAXIC - mannitol vs control",84b,23660473,XCorr,4.9900000,1.0000000,-1.5192076,,NO,8.8800000339062E-12,
EESPGPSGGGSVSPFNSSGK,ph,S,263,true,"SnRK2 protein kinase substrates",85,23776212,XCorr,3.3533301,0.9990000,,,,0.00018138099403586,
EESPGPSGGGSVSPFNSSGK,ph,S,263,true,"atm and atr DNA damage response",88,25561503,"MASCOT Score",40.0000000,1.0000000,,,,,0.5500000
EESPGPSGGGSVSPFNSSGK,ph,S,263,true,"Phospho cell culture sucrose/TOR",109,30833711,,,0.7625880,,,,,
EESPGPSGGGSVSPFNSSGK,ph,S,263,true,"Col-0 callus - FC Col-0 vs. Col-0 Xray",111a,31410901,,55.5800000,,1.1493356,0.0196129,YES,,0.1936686
EESPGPSGGGSVSPFNSSGK,ph,S,263,true,"Col-0 X-ray callus - FC Col-0 vs. Col-0 Xray",111b,31410901,,55.5800000,,1.1493356,0.0196129,YES,,0.1936686
EESPGPSGGGSVSPFNSSGK,ph,S,263,true,"atm callus - FC atm vs. atm Xray",111c,31410901,,55.5800000,,0.7126800,0.0679562,NO,,0.1936686
EESPGPSGGGSVSPFNSSGK,ph,S,263,true,"atm-3 X-ray callus - FC atm vs. atm Xray",111d,31410901,,55.5800000,,0.7126800,0.0679562,NO,,0.1936686
EESPGPSGGGSVSPFNSSGK,ph,S,263,true,"Tissue atlas Arabidopsis - ProteomicsDB",114,32188942,"MaxQuant score",346.3700000,1.0000000,,,,0,
ELALLNSNNLREESPGPSGGGSVSPFNSSGK,ph,S,267,true,"srk2dei ABA signaling phopshoproteomics",83,23572148,"MASCOT Score",62.0000000,,,,,,-0.0039000
EESPGPSGGGSVSPFNSSGK,ph,S,267,true,"atm and atr DNA damage response",88,25561503,"MASCOT Score",38.0000000,0.9210000,,,,,1.4900000
EESPGPSGGGSVSPFNSSGK,ph,S,267,true,"Tissue atlas Arabidopsis - ProteomicsDB",114,32188942,"MaxQuant score",143.7000000,0.9104690,,,,4.3710798535514E-24,
EESPGPSGGGSVSPFNSSGK,ph,S,271,true,"atm and atr DNA damage response",88,25561503,"MASCOT Score",24.0000000,0.9890000,,,,,2.2100000
EESPGPSGGGSVSPFNSSGK,ph,S,271,true,"Lateral root-induction - NAA vs control",106,23328941,"MASCOT Score",30.0000000,,,,,,
EESPGPSGGGSVSPFNSSGK,ph,S,271,true,"Tissue atlas Arabidopsis - ProteomicsDB",114,32188942,"MaxQuant score",195.0900000,0.9999950,,,,0,
ELALLNSNNLREESPGPSGGGSVSPFNSSGK,ph,S,273,true,"SnRK2 protein kinase substrates",85,23776212,XCorr,4.5581536,0.9390000,,,,0.0084024798125029,
ELALLNSNNLREESPGPSGGGSVSPFNSSGK,ph,S,273,true,"Protein sumoylation and phosphorylation cross-talk",97,28419593,,,,,,,,
ELALLNSNNLREESPGPSGGGSVSPFNSSGK,ph,S,273,true,"TOR Kinase and ABA Receptor",100,29290610,XCorr,4.2777309,0.9366000,,,,0.002998000010848,
EESPGPSGGGSVSPFNSSGKRPK,ph,S,273,true,"Chloroplast kinase substrates",60,19376835,"MASCOT Score",39.9000000,,,,,,0.9871170
EESPGPSGGGSVSPFNSSGK,ph,S,273,true,"STN8 phosphoproteome",38,21768351,"MASCOT Score",49.2700000,,,,,,-2.0708400
EESPGPSGGGSVSPFNSSGK,ph,S,273,true,"Tyrosine phosphorylation in Arabidopsis",59,18463617,"MASCOT Score",64.0000000,,,,,,-0.7720844
EESPGPSGGGSVSPFNSSGK,ph,S,273,true,"Chloroplast kinase substrates",60,19376835,"MASCOT Score",58.5800000,,,,,,-0.6516740
EESPGPSGGGSVSPFNSSGK,ph,S,273,true,"srk2dei ABA signaling phopshoproteomics",83,23572148,"MASCOT Score",49.0000000,,,,,,0.0004000
EESPGPSGGGSVSPFNSSGK,ph,S,273,true,"LAXIC - mannitol vs control",84b,23660473,XCorr,4.9900000,0.9930000,-1.5192076,,NO,8.8800000339062E-12,
EESPGPSGGGSVSPFNSSGK,ph,S,273,true,"SnRK2 protein kinase substrates",85,23776212,XCorr,3.5004799,0.9910000,,,,3.0957099947729E-13,
EESPGPSGGGSVSPFNSSGK,ph,S,273,true,"atm and atr DNA damage response",88,25561503,"MASCOT Score",66.0000000,0.9950000,,,,,1.2800000
EESPGPSGGGSVSPFNSSGK,ph,S,273,true,"Lateral root-induction - NAA vs control",106,23328941,"MASCOT Score",21.0000000,,,,,,
EESPGPSGGGSVSPFNSSGK,ph,S,273,true,"Phospho cell culture sucrose/TOR",109,30833711,,,0.9730960,,,,,
EESPGPSGGGSVSPFNSSGK,ph,S,273,true,"Col-0 callus - FC Col-0 vs. Col-0 Xray",111a,31410901,,123.9500000,,1.0362270,0.0000000,NO,,0.3216798
EESPGPSGGGSVSPFNSSGK,ph,S,273,true,"Col-0 X-ray callus - FC Col-0 vs. Col-0 Xray",111b,31410901,,123.9500000,,1.0362270,0.0000000,NO,,0.3216798
EESPGPSGGGSVSPFNSSGK,ph,S,273,true,"atm callus - FC atm vs. atm Xray",111c,31410901,,123.9500000,,0.3479011,0.0000000,NO,,0.3216798
EESPGPSGGGSVSPFNSSGK,ph,S,273,true,"atm-3 X-ray callus - FC atm vs. atm Xray",111d,31410901,,123.9500000,,0.3479011,0.0000000,NO,,0.3216798
EESPGPSGGGSVSPFNSSGK,ph,S,273,true,"Tissue atlas Arabidopsis - ProteomicsDB",114,32188942,"MaxQuant score",340.5300000,0.9999980,,,,0,
EESPGPSGGGSVSPFNSSGK,ph,S,273,true,"Touch-induced phosphorylation: 40s touch vs untouc",136,30291188,"MASCOT score",103.3400000,,0.2096648,0.5795652,NO,,-0.8133736
