Peptide,PTM,ModifiedAA,ModifiedPosition,PeptideUniqueToGene,ExperimentDesc,ExpID,PubmedID,ScoreType,IdentScore,LocProb,Log2FChange,PQ-val,QuantSig,PEP,MassErrorPPM
YQSRNEYGLADPDLYQAADK,ph,Y,6,true,"TOR Kinase and ABA Receptor",100,29290610,XCorr,4.2131047,0.9136000,,,,7.4790000326175E-6,
NGGTPENALSSHAK,ph,T,202,true,"atm and atr DNA damage response",88,25561503,"MASCOT Score",50.0000000,1.0000000,,,,,-0.7700000
NGGTPENALSSHAK,ph,T,202,true,"TOR Kinase and ABA Receptor",100,29290610,XCorr,2.9368911,0.9996000,,,,0.0031689999159425,
NGGTPENALSSHAK,ph,T,202,true,"Tissue atlas Arabidopsis - ProteomicsDB",114,32188942,"MaxQuant score",161.1000000,1.0000000,,,,5.2418201723636E-11,
LSGCLPSTSSFKSELVDSMSHVTPEANK,ph,S,484,true,"Tissue atlas Arabidopsis - ProteomicsDB",114,32188942,"MaxQuant score",163.2900000,0.9490810,,,,0,
KVDPFDSSKSCASFDAK,ph,S,584,true,"Tissue atlas Arabidopsis - ProteomicsDB",114,32188942,"MaxQuant score",70.9590000,0.9362300,,,,0.00016969100397546,
SCASFDAK,ph,S,584,true,"atm and atr DNA damage response",88,25561503,"MASCOT Score",26.0000000,1.0000000,,,,,-1.4100000
SCASFDAK,ph,S,587,true,"atm and atr DNA damage response",88,25561503,"MASCOT Score",26.0000000,1.0000000,,,,,-1.4100000
SCASFDAK,ph,S,587,true,"Tissue atlas Arabidopsis - ProteomicsDB",114,32188942,"MaxQuant score",93.4480000,0.9999990,,,,0.0062377201393247,
NSDLPSETSSISSTSEGSR,ph,T,605,true,"Phosphorylation in N starvation",63,22060019,"MASCOT Score",21.0000000,,,,,,-9.3586100
NSDLPSETSSISSTSEGSR,ph,S,606,true,"Phosphorylation in N starvation",63,22060019,"MASCOT Score",21.0000000,,,,,,-9.3586100
NSDLPSETSSISSTSEGSR,ph,S,609,true,"Phosphorylation in N starvation",63,22060019,"MASCOT Score",21.0000000,,,,,,-9.3586100
LVPCSAGVGMEVSPDTPSK,ph,S,694,true,"Tissue atlas Arabidopsis - ProteomicsDB",114,32188942,"MaxQuant score",121.0100000,0.8477340,,,,9.2616301929668E-15,
VCGPSSADGIHLK,ph,S,706,true,"Tissue atlas Arabidopsis - ProteomicsDB",114,32188942,"MaxQuant score",103.9700000,0.9925910,,,,0.00018354499479756,
DTLDDETDCVSVTNVVVDVDSK,ph,T,720,true,"srk2dei ABA signaling phopshoproteomics",83,23572148,"MASCOT Score",37.0000000,,,,,,0.0041000
DTLDDETDCVSVTNVVVDVDSK,ph,S,724,true,"srk2dei ABA signaling phopshoproteomics",83,23572148,"MASCOT Score",51.0000000,,,,,,-0.0030000
DTLDDETDCVSVTNVVVDVDSK,ph,S,724,true,"Tissue atlas Arabidopsis - ProteomicsDB",114,32188942,"MaxQuant score",237.1400000,0.9942750,,,,0,
LAGDASPTCSK,ph,S,805,true,"atm and atr DNA damage response",88,25561503,"MASCOT Score",43.0000000,1.0000000,,,,,0.5800000
LAGDASPTCSK,ph,S,805,true,"Tissue atlas Arabidopsis - ProteomicsDB",114,32188942,"MaxQuant score",178.3600000,0.9989840,,,,6.1330301460213E-14,
LAGDASPTCSK,ph,T,807,true,"SnRK2 protein kinase substrates",85,23776212,XCorr,2.5955873,0.9770000,,,,0.024561900645494,
LAGDASPTCSK,ph,T,807,true,"Col-0 callus - FC Col-0 vs. Col-0 Xray",111a,31410901,,30.9400000,,0.9162414,0.0000000,NO,,1.1507181
LAGDASPTCSK,ph,T,807,true,"Col-0 X-ray callus - FC Col-0 vs. Col-0 Xray",111b,31410901,,30.9400000,,0.9162414,0.0000000,NO,,1.1507181
LAGDASPTCSK,ph,T,807,true,"atm callus - FC atm vs. atm Xray",111c,31410901,,30.9400000,,-0.0926354,0.0000000,NO,,1.1507181
LAGDASPTCSK,ph,T,807,true,"atm-3 X-ray callus - FC atm vs. atm Xray",111d,31410901,,30.9400000,,-0.0926354,0.0000000,NO,,1.1507181
SPLEVSSEGLSTEPDNK,ph,S,917,true,"Tissue atlas Arabidopsis - ProteomicsDB",114,32188942,"MaxQuant score",125.4500000,0.9595380,,,,1.4314700536033E-9,
SPLEVSSEGLSTEPDNK,ph,S,918,true,"Tissue atlas Arabidopsis - ProteomicsDB",114,32188942,"MaxQuant score",127.9400000,0.9781140,,,,1.1035700131501E-9,
DVESIESTSPKPSLDQR,ph,S,932,true,"TOR Kinase and ABA Receptor",100,29290610,XCorr,3.3595808,0.9978000,,,,0.0035159999970347,
DVESIESTSPKPSLDQR,ph,S,932,true,"Tissue atlas Arabidopsis - ProteomicsDB",114,32188942,"MaxQuant score",238.1100000,0.9999990,,,,0,
DVESIESTSPKPSLDQR,ph,S,935,true,"TOR Kinase and ABA Receptor",100,29290610,XCorr,3.3595808,0.8975000,,,,0.0035159999970347,
DVESIESTSPKPSLDQR,ph,S,935,true,"Tissue atlas Arabidopsis - ProteomicsDB",114,32188942,"MaxQuant score",182.7400000,0.9369880,,,,0,
DVESIESTSPKPSLDQR,ph,T,936,true,"Tissue atlas Arabidopsis - ProteomicsDB",114,32188942,"MaxQuant score",171.4500000,0.8039080,,,,0,
DVESIESTSPKPSLDQR,ph,S,937,true,"TOR Kinase and ABA Receptor",100,29290610,XCorr,3.3595808,0.8957000,,,,0.0035159999970347,
DVESIESTSPKPSLDQR,ph,S,937,true,"Tissue atlas Arabidopsis - ProteomicsDB",114,32188942,"MaxQuant score",255.1600000,0.9649590,,,,0,
SLTPTQSTKVEDK,ph,S,1236,true,"Tissue atlas Arabidopsis - ProteomicsDB",114,32188942,"MaxQuant score",131.5600000,0.8577970,,,,1.5819799955352E-5,
LPRPRSPLVDAVAAHDR,ph,S,1304,true,"TOR Kinase and ABA Receptor",100,29290610,XCorr,3.0640051,1.0000000,,,,4.2030001168314E-6,
PRSPLVDAVAAHDR,ph,S,1304,true,"atm and atr DNA damage response",88,25561503,"MASCOT Score",56.0000000,1.0000000,,,,,1.2400000
SPLVDAVAAHDRR,ph,S,1304,true,"Tissue atlas Arabidopsis - ProteomicsDB",114,32188942,"MaxQuant score",128.4600000,1.0000000,,,,3.7823698221473E-5,
SPLVDAVAAHDR,ph,S,1304,true,"atm and atr DNA damage response",88,25561503,"MASCOT Score",59.0000000,1.0000000,,,,,0.8000000
SVNLKPAVTTRPSIQTGPR,ph,S,1359,true,"Tissue atlas Arabidopsis - ProteomicsDB",114,32188942,"MaxQuant score",101.4500000,0.9110540,,,,1.3038500412677E-7,
