Peptide,PTM,ModifiedAA,ModifiedPosition,PeptideUniqueToGene,ExperimentDesc,ExpID,PubmedID,ScoreType,IdentScore,LocProb,Log2FChange,PQ-val,QuantSig,PEP,MassErrorPPM
ASSSASATVAVDKATSD,nt,A,2,true,"Arg/N-end rule seed, prt6 vs. Wt",99,29168982,"MASCOT Score",41.7300000,,,,,3.1580000836584E-7,3.8393063
ASSSASATVAVDKATSD,nta,A,2,true,"Arg/N-end rule seed, prt6 vs. Wt",99,29168982,"MASCOT Score",41.7300000,,-0.1123223,0.5769395,NO,3.1580000836584E-7,3.8393063
ASSSASATVAVDKATSD,nta,A,2,true,"HUNTER N-terminome: legumain, GluC and trypsin",119,31951383,"MaxQuant score",59.1550000,,,,,,
ASSSASATVAVDK,nta,A,2,true,"Characterization plant N-terminal acetylation",6,22223895,"MASCOT Score",60.1600000,,,,,,
VQLLALTLLETLVKNCGDYLHHQVAEK,ub,K,73,true,"upl3 mutant / wildtype",168,35926874,"MaxQuant score",120.2700000,1.0000000,,,,7.1730099020999E-19,0.4415200
SGVEFPRRSPDASPIITPPVSHPPLR,ph,S,147,true,"Phosphoproteome ethylene-regulated time response",46,24043427,"MASCOT Score",57.2100000,,,,,,1.8232000
SGVEFPRRSPDASPIITPPVSHPPLR,ph,S,147,true,"PAMP-triggered phosphorylation",48,24601666,"MASCOT Score",29.3100000,,,,,,
SGVEFPRRSPDASPIITPPVSHPPLR,ph,S,147,true,"TOR Kinase and ABA Receptor",100,29290610,XCorr,3.9869239,0.9884000,,,,0.00040170000283979,
RSPDASPIITPPVSHPPLR,ph,S,147,true,"Arabidopsis root NAA phosphoproteome",18a,27643528,"MaxQuant Score",75.5390000,0.9950000,,,,4.6499998518357E-8,-0.3860000
RSPDASPIITPPVSHPPLR,ph,S,147,true,"Phosphorylation Early Elicitor Signaling",23,17317660,,,,,,,,
RSPDASPIITPPVSHPPLR,ph,S,147,true,"STN8 phosphoproteome",38,21768351,"MASCOT Score",66.0500000,,,,,,-0.9489450
RSPDASPIITPPVSHPPLR,ph,S,147,true,"PAMP-triggered phosphorylation",48,24601666,"MASCOT Score",37.4500000,,,,,,
RSPDASPIITPPVSHPPLR,ph,S,147,true,"Chloroplast kinase substrates",60,19376835,"MASCOT Score",45.3700000,,,,,,-1.5293800
RSPDASPIITPPVSHPPLR,ph,S,147,true,"SnRK2 protein kinase substrates",85,23776212,XCorr,3.5881913,0.9230000,,,,0.0015897699631751,
RSPDASPIITPPVSHPPLR,ph,S,147,true,"atm and atr DNA damage response",88,25561503,"MASCOT Score",54.0000000,1.0000000,,,,,0.2400000
RSPDASPIITPPVSHPPLR,ph,S,147,true,"TOR Kinase and ABA Receptor",100,29290610,XCorr,3.3560641,0.9988000,,,,0.00016270000196528,
RSPDASPIITPPVSHPPLR,ph,S,147,true,"Col-0 callus - FC Col-0 vs. Col-0 Xray",111a,31410901,,54.6400000,,-0.0491386,0.0000000,NO,,0.5857738
RSPDASPIITPPVSHPPLR,ph,S,147,true,"Col-0 X-ray callus - FC Col-0 vs. Col-0 Xray",111b,31410901,,54.6400000,,-0.0491386,0.0000000,NO,,0.5857738
RSPDASPIITPPVSHPPLR,ph,S,147,true,"atm callus - FC atm vs. atm Xray",111c,31410901,,54.6400000,,0.5489697,0.0000000,NO,,0.5857738
RSPDASPIITPPVSHPPLR,ph,S,147,true,"atm-3 X-ray callus - FC atm vs. atm Xray",111d,31410901,,54.6400000,,0.5489697,0.0000000,NO,,0.5857738
SPDASPIITPPVSHPPLR,ph,S,147,true,"STN8 phosphoproteome",38,21768351,"MASCOT Score",70.9700000,,,,,,-0.3881370
SPDASPIITPPVSHPPLR,ph,S,147,true,"Chloroplast kinase substrates",60,19376835,"MASCOT Score",68.5100000,,,,,,-0.3881370
SPDASPIITPPVSHPPLR,ph,S,147,true,"Phospho cell culture sucrose/TOR",109,30833711,,,0.9990160,,,,,
SPDASPIITPPVSHPPLR,ph,S,147,true,"Col-0 callus - FC Col-0 vs. Col-0 Xray",111a,31410901,,39.6900000,,0.3557403,0.0000000,NO,,1.1425344
SPDASPIITPPVSHPPLR,ph,S,147,true,"Col-0 X-ray callus - FC Col-0 vs. Col-0 Xray",111b,31410901,,39.6900000,,0.3557403,0.0000000,NO,,1.1425344
SPDASPIITPPVSHPPLR,ph,S,147,true,"atm callus - FC atm vs. atm Xray",111c,31410901,,39.6900000,,2.0346946,0.0000000,NO,,1.1425344
SPDASPIITPPVSHPPLR,ph,S,147,true,"atm-3 X-ray callus - FC atm vs. atm Xray",111d,31410901,,39.6900000,,2.0346946,0.0000000,NO,,1.1425344
SPDASPIITPPVSHPPLR,ph,S,147,true,"Tissue atlas Arabidopsis - ProteomicsDB",114,32188942,"MaxQuant score",279.4400000,1.0000000,,,,0,
SGVEFPRRSPDASPIITPPVSHPPLR,ph,S,151,true,"TOR Kinase and ABA Receptor",100,29290610,XCorr,3.9869239,0.9975000,,,,0.00040170000283979,
RSPDASPIITPPVSHPPLR,ph,S,151,true,"Phosphoproteome iron-deficient Arabidopsis roots",41,22438062,"MASCOT Score",43.5100000,,,,,,
RSPDASPIITPPVSHPPLR,ph,S,151,true,"atm and atr DNA damage response",88,25561503,"MASCOT Score",24.0000000,1.0000000,,,,,-0.6900000
RSPDASPIITPPVSHPPLR,ph,S,151,true,"Tissue atlas Arabidopsis - ProteomicsDB",114,32188942,"MaxQuant score",115.7600000,0.9999210,,,,1.6278700609718E-10,
RSPDASPIITPPVSHPPLR,ph,T,155,true,"Tissue atlas Arabidopsis - ProteomicsDB",114,32188942,"MaxQuant score",98.6320000,0.9965980,,,,2.9847899440938E-6,
HDAIASGSPLPVQASGSPLSVQASKPADSSPK,ph,S,319,true,"Large-scale phosphorylation discovery",44,23111157,XCorr,4.4540000,,,,,,
HDAIASGSPLPVQASGSPLSVQASKPADSSPK,ph,S,319,true,"MAPK Arabidopsis substrates",45,23172892,"MaxQuant Score",75.5340000,,,,,,
HDAIASGSPLPVQASGSPLSVQASKPADSSPK,ph,S,319,true,"PAMP-triggered phosphorylation",48,24601666,"MASCOT Score",49.5500000,,,,,,
HDAIASGSPLPVQASGSPLSVQASKPADSSPK,ph,S,319,true,"Phospho cell culture sucrose/TOR",109,30833711,,,0.9922280,,,,,
HDAIASGSPLPVQASGSPLSVQASKPADSSPK,ph,S,319,true,"Col-0 callus - FC Col-0 vs. Col-0 Xray",111a,31410901,,38.3200000,,0.4933065,0.0000000,NO,,0.5061601
HDAIASGSPLPVQASGSPLSVQASKPADSSPK,ph,S,319,true,"Col-0 X-ray callus - FC Col-0 vs. Col-0 Xray",111b,31410901,,38.3200000,,0.4933065,0.0000000,NO,,0.5061601
HDAIASGSPLPVQASGSPLSVQASKPADSSPK,ph,S,319,true,"atm callus - FC atm vs. atm Xray",111c,31410901,,38.3200000,,1.0010143,0.0000000,NO,,0.5061601
HDAIASGSPLPVQASGSPLSVQASKPADSSPK,ph,S,319,true,"atm-3 X-ray callus - FC atm vs. atm Xray",111d,31410901,,38.3200000,,1.0010143,0.0000000,NO,,0.5061601
HDAIASGSPLPVQASGSPLSVQASKPADSSPK,ph,S,319,true,"Tissue atlas Arabidopsis - ProteomicsDB",114,32188942,"MaxQuant score",344.4600000,0.9999710,,,,0,
GLDLNDSLQILLAKHDAIASGSPLPVQASGSPLSVQASKPADSSPK,ph,S,326,true,"MAPK Arabidopsis substrates",45,23172892,"MaxQuant Score",41.5740000,,,,,,
HDAIASGSPLPVQASGSPLSVQASKPADSSPK,ph,S,326,true,"Arabidopsis root NAA phosphoproteome",18a,27643528,"MaxQuant Score",94.2070000,0.7650000,,,,5.557000172518E-13,-1.0160000
HDAIASGSPLPVQASGSPLSVQASKPADSSPK,ph,S,326,true,"Phosphorylation Early Elicitor Signaling",23,17317660,,,,,,,,
HDAIASGSPLPVQASGSPLSVQASKPADSSPK,ph,S,326,true,"MAPK Arabidopsis substrates",45,23172892,"MaxQuant Score",77.2410000,,,,,,
HDAIASGSPLPVQASGSPLSVQASKPADSSPK,ph,S,326,true,"PAMP-triggered phosphorylation",48,24601666,"MASCOT Score",49.5500000,,,,,,
HDAIASGSPLPVQASGSPLSVQASKPADSSPK,ph,S,326,true,"Lateral root-induction - NAA vs control",106,23328941,"MASCOT Score",79.0000000,,,,,,
HDAIASGSPLPVQASGSPLSVQASKPADSSPK,ph,S,326,true,"Phospho cell culture sucrose/TOR",109,30833711,,,0.9142870,,,,,
HDAIASGSPLPVQASGSPLSVQASKPADSSPK,ph,S,326,true,"Col-0 callus - FC Col-0 vs. Col-0 Xray",111a,31410901,,38.3200000,,0.4933065,0.0000000,NO,,0.5061601
HDAIASGSPLPVQASGSPLSVQASKPADSSPK,ph,S,326,true,"Col-0 X-ray callus - FC Col-0 vs. Col-0 Xray",111b,31410901,,38.3200000,,0.4933065,0.0000000,NO,,0.5061601
HDAIASGSPLPVQASGSPLSVQASKPADSSPK,ph,S,326,true,"atm callus - FC atm vs. atm Xray",111c,31410901,,38.3200000,,1.0010143,0.0000000,NO,,0.5061601
HDAIASGSPLPVQASGSPLSVQASKPADSSPK,ph,S,326,true,"atm-3 X-ray callus - FC atm vs. atm Xray",111d,31410901,,38.3200000,,1.0010143,0.0000000,NO,,0.5061601
HDAIASGSPLPVQASGSPLSVQASKPADSSPK,ph,S,326,true,"Tissue atlas Arabidopsis - ProteomicsDB",114,32188942,"MaxQuant score",208.8500000,0.9563230,,,,0,
HDAIASGSPLPVQASGSPLSVQASKPADSSPK,ph,S,328,true,"Large-scale phosphorylation discovery",44,23111157,XCorr,6.1150000,,,,,,
HDAIASGSPLPVQASGSPLSVQASKPADSSPK,ph,S,328,true,"MAPK Arabidopsis substrates",45,23172892,"MaxQuant Score",113.4100000,,,,,,
HDAIASGSPLPVQASGSPLSVQASKPADSSPK,ph,S,328,true,"PAMP-triggered phosphorylation",48,24601666,"MASCOT Score",83.5700000,,,,,,
HDAIASGSPLPVQASGSPLSVQASKPADSSPK,ph,S,328,true,"SnRK2 protein kinase substrates",85,23776212,XCorr,4.1939945,0.9150000,,,,9.3113398935696E-11,
HDAIASGSPLPVQASGSPLSVQASKPADSSPK,ph,S,328,true,"Protein sumoylation and phosphorylation cross-talk",97,28419593,,,,,,,,
HDAIASGSPLPVQASGSPLSVQASKPADSSPK,ph,S,328,true,"TOR Kinase and ABA Receptor",100,29290610,XCorr,2.6598449,0.8180000,,,,0.0021329999435693,
HDAIASGSPLPVQASGSPLSVQASKPADSSPK,ph,S,328,true,"Phospho cell culture sucrose/TOR",109,30833711,,,0.9803680,,,,,
HDAIASGSPLPVQASGSPLSVQASKPADSSPK,ph,S,328,true,"Col-0 callus - FC Col-0 vs. Col-0 Xray",111a,31410901,,65.4500000,,0.2622996,0.0000000,NO,,-2.1247459
HDAIASGSPLPVQASGSPLSVQASKPADSSPK,ph,S,328,true,"Col-0 X-ray callus - FC Col-0 vs. Col-0 Xray",111b,31410901,,65.4500000,,0.2622996,0.0000000,NO,,-2.1247459
HDAIASGSPLPVQASGSPLSVQASKPADSSPK,ph,S,328,true,"atm callus - FC atm vs. atm Xray",111c,31410901,,65.4500000,,0.8603791,0.0000000,NO,,-2.1247459
HDAIASGSPLPVQASGSPLSVQASKPADSSPK,ph,S,328,true,"atm-3 X-ray callus - FC atm vs. atm Xray",111d,31410901,,65.4500000,,0.8603791,0.0000000,NO,,-2.1247459
HDAIASGSPLPVQASGSPLSVQASKPADSSPK,ph,S,328,true,"Tissue atlas Arabidopsis - ProteomicsDB",114,32188942,"MaxQuant score",390.6500000,0.9999830,,,,0,
HDAIASGSPLPVQASGSPLSVQASKPADSSPK,ph,S,331,true,"Large-scale phosphorylation discovery",44,23111157,XCorr,4.4580000,,,,,,
HDAIASGSPLPVQASGSPLSVQASKPADSSPK,ph,S,331,true,"MAPK Arabidopsis substrates",45,23172892,"MaxQuant Score",207.8600000,,,,,,
HDAIASGSPLPVQASGSPLSVQASKPADSSPK,ph,S,331,true,"PAMP-triggered phosphorylation",48,24601666,"MASCOT Score",67.5800000,,,,,,
HDAIASGSPLPVQASGSPLSVQASKPADSSPK,ph,S,331,true,"TOR Kinase and ABA Receptor",100,29290610,XCorr,2.6598449,0.9685000,,,,0.0021329999435693,
HDAIASGSPLPVQASGSPLSVQASKPADSSPK,ph,S,331,true,"Col-0 callus - FC Col-0 vs. Col-0 Xray",111a,31410901,,53.5200000,,0.3438448,0.0000000,NO,,1.0781041
HDAIASGSPLPVQASGSPLSVQASKPADSSPK,ph,S,331,true,"Col-0 X-ray callus - FC Col-0 vs. Col-0 Xray",111b,31410901,,53.5200000,,0.3438448,0.0000000,NO,,1.0781041
HDAIASGSPLPVQASGSPLSVQASKPADSSPK,ph,S,331,true,"atm callus - FC atm vs. atm Xray",111c,31410901,,53.5200000,,1.3602180,0.0000000,NO,,1.0781041
HDAIASGSPLPVQASGSPLSVQASKPADSSPK,ph,S,331,true,"atm-3 X-ray callus - FC atm vs. atm Xray",111d,31410901,,53.5200000,,1.3602180,0.0000000,NO,,1.0781041
HDAIASGSPLPVQASGSPLSVQASKPADSSPK,ph,S,340,true,"Large-scale phosphorylation discovery",44,23111157,XCorr,7.2250000,,,,,,
HDAIASGSPLPVQASGSPLSVQASKPADSSPK,ph,S,340,true,"MAPK Arabidopsis substrates",45,23172892,"MaxQuant Score",77.2410000,,,,,,
HDAIASGSPLPVQASGSPLSVQASKPADSSPK,ph,S,340,true,"Tissue atlas Arabidopsis - ProteomicsDB",114,32188942,"MaxQuant score",432.4900000,0.8252140,,,,0,
HDAIASGSPLPVQASGSPLSVQASKPADSSPK,ph,S,341,true,"MAPK Arabidopsis substrates",45,23172892,"MaxQuant Score",113.4100000,,,,,,
HDAIASGSPLPVQASGSPLSVQASKPADSSPK,ph,S,341,true,"SnRK2 protein kinase substrates",85,23776212,XCorr,4.1939945,0.8080000,,,,9.3113398935696E-11,
HDAIASGSPLPVQASGSPLSVQASKPADSSPK,ph,S,341,true,"Col-0 callus - FC Col-0 vs. Col-0 Xray",111a,31410901,,69.8000000,,0.6939713,0.0000000,NO,,1.2298644
HDAIASGSPLPVQASGSPLSVQASKPADSSPK,ph,S,341,true,"Col-0 X-ray callus - FC Col-0 vs. Col-0 Xray",111b,31410901,,69.8000000,,0.6939713,0.0000000,NO,,1.2298644
HDAIASGSPLPVQASGSPLSVQASKPADSSPK,ph,S,341,true,"atm callus - FC atm vs. atm Xray",111c,31410901,,69.8000000,,1.7133164,0.0000000,NO,,1.2298644
HDAIASGSPLPVQASGSPLSVQASKPADSSPK,ph,S,341,true,"atm-3 X-ray callus - FC atm vs. atm Xray",111d,31410901,,69.8000000,,1.7133164,0.0000000,NO,,1.2298644
HDAIASGSPLPVQASGSPLSVQASKPADSSPK,ph,S,341,true,"Tissue atlas Arabidopsis - ProteomicsDB",114,32188942,"MaxQuant score",419.9900000,0.9156920,,,,0,
DSSSIAGSSSPIPATVSTGK,ph,S,351,true,"SnRK2 protein kinase substrates",85,23776212,XCorr,3.7308903,0.8260000,,,,0.012474000453949,
DSSSIAGSSSPIPATVSTGK,ph,S,351,true,"Tissue atlas Arabidopsis - ProteomicsDB",114,32188942,"MaxQuant score",237.8300000,0.7574200,,,,0,
DSSSIAGSSSPIPATVSTGK,ph,S,352,true,"Lateral root-induction - NAA vs control",106,23328941,"MASCOT Score",23.0000000,,,,,,
DSSSIAGSSSPIPATVSTGK,ph,S,352,true,"Col-0 callus - FC Col-0 vs. Col-0 Xray",111a,31410901,,39.3100000,,-0.0314107,0.0000000,NO,,1.5020259
DSSSIAGSSSPIPATVSTGK,ph,S,352,true,"Col-0 X-ray callus - FC Col-0 vs. Col-0 Xray",111b,31410901,,39.3100000,,-0.0314107,0.0000000,NO,,1.5020259
DSSSIAGSSSPIPATVSTGK,ph,S,352,true,"atm callus - FC atm vs. atm Xray",111c,31410901,,39.3100000,,0.2408232,0.0000000,NO,,1.5020259
DSSSIAGSSSPIPATVSTGK,ph,S,352,true,"atm-3 X-ray callus - FC atm vs. atm Xray",111d,31410901,,39.3100000,,0.2408232,0.0000000,NO,,1.5020259
DSSSIAGSSSPIPATVSTGK,ph,S,352,true,"Tissue atlas Arabidopsis - ProteomicsDB",114,32188942,"MaxQuant score",258.2300000,0.9303750,,,,0,
DSSSIAGSSSPIPATVSTGK,ph,S,356,true,"Large-scale phosphorylation discovery",44,23111157,XCorr,3.4140000,,,,,,
DSSSIAGSSSPIPATVSTGK,ph,S,356,true,"srk2dei ABA signaling phopshoproteomics",83,23572148,"MASCOT Score",40.0000000,,,,,,0.0009000
DSSSIAGSSSPIPATVSTGK,ph,S,356,true,"Lateral root-induction - NAA vs control",106,23328941,"MASCOT Score",38.0000000,,,,,,
DSSSIAGSSSPIPATVSTGK,ph,S,356,true,"Col-0 callus - FC Col-0 vs. Col-0 Xray",111a,31410901,,39.3100000,,-0.0314107,0.0000000,NO,,1.5020259
DSSSIAGSSSPIPATVSTGK,ph,S,356,true,"Col-0 X-ray callus - FC Col-0 vs. Col-0 Xray",111b,31410901,,39.3100000,,-0.0314107,0.0000000,NO,,1.5020259
DSSSIAGSSSPIPATVSTGK,ph,S,356,true,"atm callus - FC atm vs. atm Xray",111c,31410901,,39.3100000,,0.2408232,0.0000000,NO,,1.5020259
DSSSIAGSSSPIPATVSTGK,ph,S,356,true,"atm-3 X-ray callus - FC atm vs. atm Xray",111d,31410901,,39.3100000,,0.2408232,0.0000000,NO,,1.5020259
DSSSIAGSSSPIPATVSTGK,ph,S,357,true,"Lateral root-induction - NAA vs control",106,23328941,"MASCOT Score",30.0000000,,,,,,
DSSSIAGSSSPIPATVSTGK,ph,S,357,true,"Tissue atlas Arabidopsis - ProteomicsDB",114,32188942,"MaxQuant score",261.7600000,0.8182590,,,,0,
DSSSIAGSSSPIPATVSTGK,ph,S,358,true,"STN8 phosphoproteome",38,21768351,"MASCOT Score",45.1100000,,,,,,-0.7385810
DSSSIAGSSSPIPATVSTGK,ph,S,358,true,"Large-scale phosphorylation discovery",44,23111157,XCorr,4.5920000,,,,,,
DSSSIAGSSSPIPATVSTGK,ph,S,358,true,"Tyrosine phosphorylation in Arabidopsis",59,18463617,"MASCOT Score",72.0000000,,,,,,-0.6743171
DSSSIAGSSSPIPATVSTGK,ph,S,358,true,"Chloroplast kinase substrates",60,19376835,"MASCOT Score",40.1900000,,,,,,-1.5054600
DSSSIAGSSSPIPATVSTGK,ph,S,358,true,"srk2dei ABA signaling phopshoproteomics",83,23572148,"MASCOT Score",72.0000000,,,,,,-0.0003000
DSSSIAGSSSPIPATVSTGK,ph,S,358,true,"LAXIC - ABA stress",84a,23660473,XCorr,4.6100000,0.9570000,,,,2.0600000425475E-6,
DSSSIAGSSSPIPATVSTGK,ph,S,358,true,"SnRK2 protein kinase substrates",85,23776212,XCorr,4.0014157,0.9610000,,,,0.00026317100855522,
DSSSIAGSSSPIPATVSTGK,ph,S,358,true,"atm and atr DNA damage response",88,25561503,"MASCOT Score",78.0000000,0.9940000,,,,,-0.9500000
DSSSIAGSSSPIPATVSTGK,ph,S,358,true,"Brassinosteroid-Regulated Phosphorylation Dynamics",94,26187819,"MaxQuant Score",136.6600000,0.9270000,,,,3.1089998739527E-13,1.0270000
DSSSIAGSSSPIPATVSTGK,ph,S,358,true,"Protein sumoylation and phosphorylation cross-talk",97,28419593,,,,,,,,
DSSSIAGSSSPIPATVSTGK,ph,S,358,true,"TOR Kinase and ABA Receptor",100,29290610,XCorr,4.8450007,0.9067000,,,,5.5100002782638E-7,
DSSSIAGSSSPIPATVSTGK,ph,S,358,true,"Lateral root-induction - NAA vs control",106,23328941,"MASCOT Score",45.0000000,,,,,,
DSSSIAGSSSPIPATVSTGK,ph,S,358,true,"Phospho cell culture sucrose/TOR",109,30833711,,,0.9674190,,,,,
DSSSIAGSSSPIPATVSTGK,ph,S,358,true,"Col-0 callus - FC Col-0 vs. Col-0 Xray",111a,31410901,,76.8400000,,0.0250684,0.0000000,NO,,1.5122924
DSSSIAGSSSPIPATVSTGK,ph,S,358,true,"Col-0 X-ray callus - FC Col-0 vs. Col-0 Xray",111b,31410901,,76.8400000,,0.0250684,0.0000000,NO,,1.5122924
DSSSIAGSSSPIPATVSTGK,ph,S,358,true,"atm callus - FC atm vs. atm Xray",111c,31410901,,76.8400000,,0.4250888,0.0000000,NO,,1.5122924
DSSSIAGSSSPIPATVSTGK,ph,S,358,true,"atm-3 X-ray callus - FC atm vs. atm Xray",111d,31410901,,76.8400000,,0.4250888,0.0000000,NO,,1.5122924
DSSSIAGSSSPIPATVSTGK,ph,S,358,true,"Tissue atlas Arabidopsis - ProteomicsDB",114,32188942,"MaxQuant score",317.5800000,0.9992690,,,,0,
DSSSIAGSSSPIPATVSTGK,ph,S,358,true,"Touch-induced phosphorylation: 40s touch vs untouc",136,30291188,"MASCOT score",87.1800000,,-0.0584686,0.7908071,NO,,-2.3764817
DSSSIAGSSSPIPATVSTGK,ph,T,363,true,"srk2dei ABA signaling phopshoproteomics",83,23572148,"MASCOT Score",53.0000000,,,,,,0.0012000
ANASASYTDTSALAGR,og,S,577,true,"O-GlcNac Inflorescence Tissue",81,28154133,"MASCOT Score",28.7000000,,,,,,2.8000000
ANASASYTDTSALAGR,ph,S,577,true,"Tissue atlas Arabidopsis - ProteomicsDB",114,32188942,"MaxQuant score",108.3400000,0.9999480,,,,2.6815999376595E-7,
ANASASYTDTSALAGR,og,S,579,true,"O-GlcNac Inflorescence Tissue",81,28154133,"MASCOT Score",40.0000000,,,,,,0.8300000
ANASASYTDTSALAGR,ph,S,579,true,"Tissue atlas Arabidopsis - ProteomicsDB",114,32188942,"MaxQuant score",152.2500000,0.9997450,,,,2.4441400390819E-16,
SLQQSNSFPTR,ph,S,590,true,"Tissue atlas Arabidopsis - ProteomicsDB",114,32188942,"MaxQuant score",62.8910000,0.9999490,,,,0.0095388796180487,
SLQQSNSFPTR,ph,S,594,true,"srk2dei ABA signaling phopshoproteomics",83,23572148,"MASCOT Score",47.0000000,,,,,,-0.0003000
SLQQSNSFPTR,ph,S,594,true,"Lateral root-induction - NAA vs control",106,23328941,"MASCOT Score",23.0000000,,,,,,
SLQQSNSFPTR,ph,S,594,true,"Tissue atlas Arabidopsis - ProteomicsDB",114,32188942,"MaxQuant score",104.9400000,0.9980610,,,,5.0700498832157E-5,
SLQQSNSFPTR,ph,S,596,true,"Arabidopsis root NAA phosphoproteome",18a,27643528,"MaxQuant Score",47.7740000,0.8740000,,,,0.00099380000028759,0.5150000
SLQQSNSFPTR,ph,S,596,true,"STN8 phosphoproteome",38,21768351,"MASCOT Score",48.9100000,,,,,,-0.8861330
SLQQSNSFPTR,ph,S,596,true,"Chloroplast kinase substrates",60,19376835,"MASCOT Score",37.5300000,,,,,,-0.5294160
SLQQSNSFPTR,ph,S,596,true,"srk2dei ABA signaling phopshoproteomics",83,23572148,"MASCOT Score",48.0000000,,,,,,0.0004000
SLQQSNSFPTR,ph,S,596,true,"SnRK2 protein kinase substrates",85,23776212,XCorr,2.1291785,0.9930000,,,,0.0037083399947733,
SLQQSNSFPTR,ph,S,596,true,"atm and atr DNA damage response",88,25561503,"MASCOT Score",53.0000000,0.9470000,,,,,0.5600000
SLQQSNSFPTR,ph,S,596,true,"Protein sumoylation and phosphorylation cross-talk",97,28419593,,,,,,,,
SLQQSNSFPTR,ph,S,596,true,"TOR Kinase and ABA Receptor",100,29290610,XCorr,3.0150762,0.9000000,,,,0.00052509998204187,
SLQQSNSFPTR,ph,S,596,true,"Phospho cell culture sucrose/TOR",109,30833711,,,0.9997410,,,,,
SLQQSNSFPTR,ph,S,596,true,"Col-0 callus - FC Col-0 vs. Col-0 Xray",111a,31410901,,46.0600000,,0.2179285,0.0000000,NO,,0.5236446
SLQQSNSFPTR,ph,S,596,true,"Col-0 X-ray callus - FC Col-0 vs. Col-0 Xray",111b,31410901,,46.0600000,,0.2179285,0.0000000,NO,,0.5236446
SLQQSNSFPTR,ph,S,596,true,"atm callus - FC atm vs. atm Xray",111c,31410901,,46.0600000,,-0.8246163,0.0000000,NO,,0.5236446
SLQQSNSFPTR,ph,S,596,true,"atm-3 X-ray callus - FC atm vs. atm Xray",111d,31410901,,46.0600000,,-0.8246163,0.0000000,NO,,0.5236446
SLQQSNSFPTR,ph,S,596,true,"Tissue atlas Arabidopsis - ProteomicsDB",114,32188942,"MaxQuant score",255.5400000,0.9999950,,,,0,
SLQQSNSFPTRAGDPQATSTASNSGVSVGQKPFVPSYR,ph,T,599,true,"MAPK Arabidopsis substrates",45,23172892,"MaxQuant Score",81.8030000,,,,,,
AGDPQATSTASNSGVSVGQKPFVPSYR,ph,S,613,true,"Tissue atlas Arabidopsis - ProteomicsDB",114,32188942,"MaxQuant score",147.3500000,0.8960140,,,,0,
