Peptide,PTM,ModifiedAA,ModifiedPosition,PeptideUniqueToGene,ExperimentDesc,ExpID,PubmedID,ScoreType,IdentScore,LocProb,Log2FChange,PQ-val,QuantSig,PEP,MassErrorPPM
RFPSLSR,ph,S,32,true,"Tissue atlas Arabidopsis - ProteomicsDB",114,32188942,"MaxQuant score",108.5700000,0.9998530,,,,0.015874600037932,
SCSVIGGDGDNVGSLR,sno,C,87,true,"hot5-4 / wildtype, FAT-switch S-nitrosoproteome",169,37277371,,,,0.3996030,0.0057371,NO,,
SCSVIGGDGDNVGSLR,ph,S,88,true,"Large-scale phosphorylation discovery",44,23111157,XCorr,5.2740000,,,,,,
SCSVIGGDGDNVGSLR,ph,S,88,true,"Tissue atlas Arabidopsis - ProteomicsDB",114,32188942,"MaxQuant score",80.5450000,0.9965700,,,,0.00031442299950868,
QVHVVSGLPAASSTERLDILDDER,ph,S,113,true,"Large-scale phosphorylation discovery",44,23111157,XCorr,3.2880000,,,,,,
QVHVVSGLPAASSTERLDILDDER,ph,S,113,true,"TOR Kinase and ABA Receptor",100,29290610,XCorr,3.0377407,0.8255000,,,,0.0020439999643713,
QVHVVSGLPAASSTER,ph,S,113,true,"Large-scale phosphorylation discovery",44,23111157,XCorr,2.7740000,,,,,,
QVHVVSGLPAASSTER,ph,S,113,true,"Tissue atlas Arabidopsis - ProteomicsDB",114,32188942,"MaxQuant score",173.0600000,0.8085110,,,,0,
QVHVVSGLPAASSTERLDILDDER,ph,S,114,true,"Large-scale phosphorylation discovery",44,23111157,XCorr,3.3550000,,,,,,
QVHVVSGLPAASSTER,ph,S,114,true,"atm and atr DNA damage response",88,25561503,"MASCOT Score",80.0000000,0.8860000,,,,,-0.2700000
