Peptide,PTM,ModifiedAA,ModifiedPosition,PeptideUniqueToGene,ExperimentDesc,ExpID,PubmedID,ScoreType,IdentScore,LocProb,Log2FChange,PQ-val,QuantSig,PEP,MassErrorPPM
VNDQYGRSPASLPDATPFTDGGGGGGGDTGR,ph,Y,70,true,"TOR Kinase and ABA Receptor",100,29290610,XCorr,6.2064066,0.8531000,,,,5.6739999365618E-8,
KVNDQYGRSPASLPDATPFTDGGGGGGGDTGR,ph,S,73,true,"MAPK Arabidopsis substrates",45,23172892,"MaxQuant Score",57.2990000,,,,,,
VNDQYGRSPASLPDATPFTDGGGGGGGDTGR,ph,S,73,true,"Arabidopsis root NAA phosphoproteome",18a,27643528,"MaxQuant Score",73.1640000,0.8260000,,,,1.3130000198203E-8,3.5240000
VNDQYGRSPASLPDATPFTDGGGGGGGDTGR,ph,S,73,true,"Brassinosteroid-Regulated Phosphorylation Dynamics",94,26187819,"MaxQuant Score",116.9900000,0.9400000,,,,1.1230000219672E-12,0.6420000
VNDQYGRSPASLPDATPFTDGGGGGGGDTGR,ph,S,73,true,"Phospho cell culture sucrose/TOR",109,30833711,,,0.9952810,,,,,
VNDQYGRSPASLPDATPFTDGGGGGGGDTGR,ph,S,73,true,"Col-0 callus - FC Col-0 vs. Col-0 Xray",111a,31410901,,91.0700000,,0.7335988,0.0396660,YES,,1.2878035
VNDQYGRSPASLPDATPFTDGGGGGGGDTGR,ph,S,73,true,"Col-0 X-ray callus - FC Col-0 vs. Col-0 Xray",111b,31410901,,91.0700000,,0.7335988,0.0396660,YES,,1.2878035
VNDQYGRSPASLPDATPFTDGGGGGGGDTGR,ph,S,73,true,"atm callus - FC atm vs. atm Xray",111c,31410901,,91.0700000,,0.7509813,0.0881812,NO,,1.2878035
VNDQYGRSPASLPDATPFTDGGGGGGGDTGR,ph,S,73,true,"atm-3 X-ray callus - FC atm vs. atm Xray",111d,31410901,,91.0700000,,0.7509813,0.0881812,NO,,1.2878035
SPASLPDATPFTDGGGGGGGDTGR,ph,S,73,true,"Tyrosine phosphorylation in Arabidopsis",59,18463617,"MASCOT Score",61.0000000,,,,,,-0.8535794
SPASLPDATPFTDGGGGGGGDTGR,ph,S,73,true,"Lateral root-induction - NAA vs control",106,23328941,"MASCOT Score",64.0000000,,,,,,
SPASLPDATPFTDGGGGGGGDTGR,ph,S,73,true,"Col-0 callus - FC Col-0 vs. Col-0 Xray",111a,31410901,,122.0400000,,0.6069512,0.0000000,NO,,1.1148619
SPASLPDATPFTDGGGGGGGDTGR,ph,S,73,true,"Col-0 X-ray callus - FC Col-0 vs. Col-0 Xray",111b,31410901,,122.0400000,,0.6069512,0.0000000,NO,,1.1148619
SPASLPDATPFTDGGGGGGGDTGR,ph,S,73,true,"atm callus - FC atm vs. atm Xray",111c,31410901,,122.0400000,,0.8144856,0.0000000,NO,,1.1148619
SPASLPDATPFTDGGGGGGGDTGR,ph,S,73,true,"atm-3 X-ray callus - FC atm vs. atm Xray",111d,31410901,,122.0400000,,0.8144856,0.0000000,NO,,1.1148619
SPASLPDATPFTDGGGGGGGDTGR,ph,S,73,true,"Tissue atlas Arabidopsis - ProteomicsDB",114,32188942,"MaxQuant score",299.6900000,1.0000000,,,,0,
VNDQYGRSPASLPDATPFTDGGGGGGGDTGR,ph,S,76,true,"Conserved plant phosphoproteome - Arabidopsis",61a,20466843,"MASCOT Score",62.0000000,1.0000000,,,,,
VNDQYGRSPASLPDATPFTDGGGGGGGDTGR,ph,S,76,true,"TOR Kinase and ABA Receptor",100,29290610,XCorr,6.4249663,0.9859000,,,,5.1370002696061E-10,
SPASLPDATPFTDGGGGGGGDTGR,ph,S,76,true,"atm and atr DNA damage response",88,25561503,"MASCOT Score",72.0000000,0.9400000,,,,,-0.1400000
SPASLPDATPFTDGGGGGGGDTGR,ph,S,76,true,"Phospho cell culture sucrose/TOR",109,30833711,,,0.9930570,,,,,
SPASLPDATPFTDGGGGGGGDTGR,ph,S,76,true,"Tissue atlas Arabidopsis - ProteomicsDB",114,32188942,"MaxQuant score",296.8100000,1.0000000,,,,0,
SPASLPDATPFTDGGGGGGGDTGR,ph,T,81,true,"Tissue atlas Arabidopsis - ProteomicsDB",114,32188942,"MaxQuant score",143.4700000,0.9996480,,,,0,
SPASLPDATPFTDGGGGGGGDTGR,ph,T,94,true,"Tissue atlas Arabidopsis - ProteomicsDB",114,32188942,"MaxQuant score",140.5700000,0.9939690,,,,4.0744700498164E-34,
SNGHVYVDEIPPGLPR,ph,S,97,true,"Tissue atlas Arabidopsis - ProteomicsDB",114,32188942,"MaxQuant score",127.4900000,1.0000000,,,,2.6460000412953E-8,
LHTPSEGR,ph,T,115,true,"atm and atr DNA damage response",88,25561503,"MASCOT Score",30.0000000,1.0000000,,,,,-0.3100000
LHTPSEGR,ph,T,115,true,"Tissue atlas Arabidopsis - ProteomicsDB",114,32188942,"MaxQuant score",154.8500000,0.9996370,,,,0.0042116600088775,
LHTPSEGR,ph,S,117,true,"Tissue atlas Arabidopsis - ProteomicsDB",114,32188942,"MaxQuant score",161.1700000,0.9999890,,,,0.0011041399557143,
ASVHGASSIR,ph,S,122,true,"atm and atr DNA damage response",88,25561503,"MASCOT Score",49.0000000,0.9990000,,,,,-0.3500000
ASVHGASSIR,ph,S,122,true,"Tissue atlas Arabidopsis - ProteomicsDB",114,32188942,"MaxQuant score",151.9400000,1.0000000,,,,3.7724998722037E-18,
ASVHGASSIRK,ph,S,127,true,"Phospho cell culture sucrose/TOR",109,30833711,,,0.8326850,,,,,
ASVHGASSIR,ph,S,127,true,"atm and atr DNA damage response",88,25561503,"MASCOT Score",30.0000000,0.9950000,,,,,0.2200000
ASVHGASSIR,ph,S,127,true,"Tissue atlas Arabidopsis - ProteomicsDB",114,32188942,"MaxQuant score",164.8100000,0.9415550,,,,3.4487101174818E-7,
ASVHGASSIR,ph,S,128,true,"STN8 phosphoproteome",38,21768351,"MASCOT Score",39.3500000,,,,,,-0.2387460
ASVHGASSIR,ph,S,128,true,"Chloroplast kinase substrates",60,19376835,"MASCOT Score",39.6800000,,,,,,0.6247020
ASVHGASSIR,ph,S,128,true,"Tissue atlas Arabidopsis - ProteomicsDB",114,32188942,"MaxQuant score",163.4500000,0.8624390,,,,4.2582499304444E-7,
KTGSFVRPISPK,ph,T,132,true,"STN8 phosphoproteome",38,21768351,"MASCOT Score",42.9800000,,,,,,
KTGSFVRPISPK,ph,T,132,true,"Chloroplast kinase substrates",60,19376835,"MASCOT Score",34.7400000,,,,,,-0.7879650
KTGSFVRPISPK,ph,T,132,true,"Col-0 callus - FC Col-0 vs. Col-0 Xray",111a,31410901,,39.3000000,,-0.1177540,0.0000000,NO,,0.3384341
KTGSFVRPISPK,ph,T,132,true,"Col-0 X-ray callus - FC Col-0 vs. Col-0 Xray",111b,31410901,,39.3000000,,-0.1177540,0.0000000,NO,,0.3384341
KTGSFVRPISPK,ph,T,132,true,"atm callus - FC atm vs. atm Xray",111c,31410901,,39.3000000,,0.7392284,0.0000000,NO,,0.3384341
KTGSFVRPISPK,ph,T,132,true,"atm-3 X-ray callus - FC atm vs. atm Xray",111d,31410901,,39.3000000,,0.7392284,0.0000000,NO,,0.3384341
TGSFVRPISPK,ph,T,132,true,"STN8 phosphoproteome",38,21768351,"MASCOT Score",44.5000000,,,,,,
TGSFVRPISPK,ph,T,132,true,"Tissue atlas Arabidopsis - ProteomicsDB",114,32188942,"MaxQuant score",110.3800000,0.8351320,,,,0.0042196097783744,
KTGSFVRPISPK,ph,S,134,true,"Phosphoproteome ethylene-regulated time response",46,24043427,"MASCOT Score",24.9900000,,,,,,-10.9164000
KTGSFVRPISPK,ph,S,134,true,"atm and atr DNA damage response",88,25561503,"MASCOT Score",30.0000000,1.0000000,,,,,-1.4800000
TGSFVRPISPK,ph,S,134,true,"atm and atr DNA damage response",88,25561503,"MASCOT Score",45.0000000,0.9880000,,,,,-0.3200000
TGSFVRPISPK,ph,S,134,true,"Brassinosteroid-Regulated Phosphorylation Dynamics",94,26187819,"MaxQuant Score",119.9200000,0.9950000,,,,0.0099999997764826,0.7800000
TGSFVRPISPK,ph,S,134,true,"TOR Kinase and ABA Receptor",100,29290610,XCorr,3.0871220,0.9018000,,,,0.011479999870062,
TGSFVRPISPK,ph,S,134,true,"Phospho cell culture sucrose/TOR",109,30833711,,,1.0000000,,,,,
TGSFVRPISPK,ph,S,134,true,"Col-0 callus - FC Col-0 vs. Col-0 Xray",111a,31410901,,26.7700000,,1.0038267,0.0106945,YES,,0.0117799
TGSFVRPISPK,ph,S,134,true,"Col-0 X-ray callus - FC Col-0 vs. Col-0 Xray",111b,31410901,,26.7700000,,1.0038267,0.0106945,YES,,0.0117799
TGSFVRPISPK,ph,S,134,true,"atm callus - FC atm vs. atm Xray",111c,31410901,,26.7700000,,0.8597949,0.1126447,NO,,0.0117799
TGSFVRPISPK,ph,S,134,true,"atm-3 X-ray callus - FC atm vs. atm Xray",111d,31410901,,26.7700000,,0.8597949,0.1126447,NO,,0.0117799
TGSFVRPISPK,ph,S,134,true,"Tissue atlas Arabidopsis - ProteomicsDB",114,32188942,"MaxQuant score",176.9900000,0.9999730,,,,2.7250699526776E-12,
KTGSFVRPISPK,ph,S,140,true,"Phosphoproteome ethylene-regulated time response",46,24043427,"MASCOT Score",24.9900000,,,,,,-10.9164000
KTGSFVRPISPK,ph,S,140,true,"Chloroplast kinase substrates",60,19376835,"MASCOT Score",34.7400000,,,,,,-0.7879650
KTGSFVRPISPK,ph,S,140,true,"atm and atr DNA damage response",88,25561503,"MASCOT Score",25.0000000,1.0000000,,,,,-0.7900000
KTGSFVRPISPK,ph,S,140,true,"Col-0 callus - FC Col-0 vs. Col-0 Xray",111a,31410901,,29.9600000,,2.7055546,0.0000000,NO,,0.6605463
KTGSFVRPISPK,ph,S,140,true,"Col-0 X-ray callus - FC Col-0 vs. Col-0 Xray",111b,31410901,,29.9600000,,2.7055546,0.0000000,NO,,0.6605463
KTGSFVRPISPK,ph,S,140,true,"atm callus - FC atm vs. atm Xray",111c,31410901,,29.9600000,,3.6247918,0.0000000,NO,,0.6605463
KTGSFVRPISPK,ph,S,140,true,"atm-3 X-ray callus - FC atm vs. atm Xray",111d,31410901,,29.9600000,,3.6247918,0.0000000,NO,,0.6605463
TGSFVRPISPK,ph,S,140,true,"Ethylene-regulated phosphorylation ein2 mutant",30,19253305,"MASCOT Score",34.9206000,,,,,,-2.2148510
TGSFVRPISPK,ph,S,140,true,"STN8 phosphoproteome",38,21768351,"MASCOT Score",50.7700000,,,,,,-0.2822690
TGSFVRPISPK,ph,S,140,true,"Phosphoproteome ethylene-regulated time response",46,24043427,"MASCOT Score",61.7200000,,,,,,5.4836000
TGSFVRPISPK,ph,S,140,true,"Tyrosine phosphorylation in Arabidopsis",59,18463617,"MASCOT Score",35.0000000,,,,,,-0.7888728
TGSFVRPISPK,ph,S,140,true,"Chloroplast kinase substrates",60,19376835,"MASCOT Score",35.3000000,,,,,,-0.2822690
TGSFVRPISPK,ph,S,140,true,"Conserved plant phosphoproteome - Arabidopsis",61a,20466843,"MASCOT Score",37.0000000,1.0000000,,,,,
TGSFVRPISPK,ph,S,140,true,"atm and atr DNA damage response",88,25561503,"MASCOT Score",40.0000000,1.0000000,,,,,-1.5700000
TGSFVRPISPK,ph,S,140,true,"Brassinosteroid-Regulated Phosphorylation Dynamics",94,26187819,"MaxQuant Score",119.9200000,1.0000000,,,,0.0099999997764826,0.7800000
TGSFVRPISPK,ph,S,140,true,"TOR Kinase and ABA Receptor",100,29290610,XCorr,3.3209140,1.0000000,,,,0.010730000212789,
TGSFVRPISPK,ph,S,140,true,"Lateral root-induction - NAA vs control",106,23328941,"MASCOT Score",26.0000000,,,,,,
TGSFVRPISPK,ph,S,140,true,"Col-0 callus - FC Col-0 vs. Col-0 Xray",111a,31410901,,26.7700000,,1.0038267,0.0106945,YES,,0.0117799
TGSFVRPISPK,ph,S,140,true,"Col-0 X-ray callus - FC Col-0 vs. Col-0 Xray",111b,31410901,,26.7700000,,1.0038267,0.0106945,YES,,0.0117799
TGSFVRPISPK,ph,S,140,true,"atm callus - FC atm vs. atm Xray",111c,31410901,,26.7700000,,0.8597949,0.1126447,NO,,0.0117799
TGSFVRPISPK,ph,S,140,true,"atm-3 X-ray callus - FC atm vs. atm Xray",111d,31410901,,26.7700000,,0.8597949,0.1126447,NO,,0.0117799
TGSFVRPISPK,ph,S,140,true,"Tissue atlas Arabidopsis - ProteomicsDB",114,32188942,"MaxQuant score",232.1300000,1.0000000,,,,5.9989587257745E-42,
TGSFVRPISPK,ph,S,140,true,"Touch-induced phosphorylation: 40s touch vs untouc",136,30291188,"MASCOT score",63.6700000,,-0.3310504,0.0002396,YES,,3.8117671
SHSVSGDLHGVQPDPIAADILRKEPEQETFVR,ph,S,201,true,"MAPK Arabidopsis substrates",45,23172892,"MaxQuant Score",84.7410000,,,,,,
SHSVSGDLHGVQPDPIAADILR,ph,S,201,true,"Tissue atlas Arabidopsis - ProteomicsDB",114,32188942,"MaxQuant score",62.5820000,0.8403610,,,,0.00043936001020484,
SHSVSGDLHGVQPDPIAADILRK,ph,S,203,true,"TOR Kinase and ABA Receptor",100,29290610,XCorr,5.0707536,0.8478000,,,,1.7980000084281E-12,
SHSVSGDLHGVQPDPIAADILR,ph,S,203,true,"Arabidopsis root NAA phosphoproteome",18a,27643528,"MaxQuant Score",118.8500000,0.9880000,,,,1.923999977717E-18,0.3090000
SHSVSGDLHGVQPDPIAADILR,ph,S,203,true,"Mitochondrial phosphoproteome",32,19688752,"MASCOT Score",62.5000000,,,,,,3.8117200
SHSVSGDLHGVQPDPIAADILR,ph,S,203,true,"ABA-induced protein phosphorylation",35,20733066,,,,,,,,
SHSVSGDLHGVQPDPIAADILR,ph,S,203,true,"Large-scale phosphorylation discovery",44,23111157,XCorr,5.9220000,,,,,,
SHSVSGDLHGVQPDPIAADILR,ph,S,203,true,"MAPK Arabidopsis substrates",45,23172892,"MaxQuant Score",153.2100000,,,,,,
SHSVSGDLHGVQPDPIAADILR,ph,S,203,true,"Phosphoproteome ethylene-regulated time response",46,24043427,"MASCOT Score",78.1400000,,,,,,-7.1691000
SHSVSGDLHGVQPDPIAADILR,ph,S,203,true,"PAMP-triggered phosphorylation",48,24601666,"MASCOT Score",56.3300000,,,,,,
SHSVSGDLHGVQPDPIAADILR,ph,S,203,true,"SnRK2 protein kinase substrates",85,23776212,XCorr,4.6629748,0.8920000,,,,2.8677199225058E-5,
SHSVSGDLHGVQPDPIAADILR,ph,S,203,true,"atm and atr DNA damage response",88,25561503,"MASCOT Score",48.0000000,0.9930000,,,,,-1.5300000
SHSVSGDLHGVQPDPIAADILR,ph,S,203,true,"TOR Kinase and ABA Receptor",100,29290610,XCorr,4.8013110,0.9930000,,,,1.4580000318176E-8,
SHSVSGDLHGVQPDPIAADILR,ph,S,203,true,"Lateral root-induction - NAA vs control",106,23328941,"MASCOT Score",37.0000000,,,,,,
SHSVSGDLHGVQPDPIAADILR,ph,S,203,true,"Phospho cell culture sucrose/TOR",109,30833711,,,0.9999440,,,,,
SHSVSGDLHGVQPDPIAADILR,ph,S,203,true,"Col-0 callus - FC Col-0 vs. Col-0 Xray",111a,31410901,,84.1500000,,0.7633144,0.0000000,NO,,1.0329004
SHSVSGDLHGVQPDPIAADILR,ph,S,203,true,"Col-0 X-ray callus - FC Col-0 vs. Col-0 Xray",111b,31410901,,84.1500000,,0.7633144,0.0000000,NO,,1.0329004
SHSVSGDLHGVQPDPIAADILR,ph,S,203,true,"atm callus - FC atm vs. atm Xray",111c,31410901,,84.1500000,,-3.9633545,0.0000000,NO,,1.0329004
SHSVSGDLHGVQPDPIAADILR,ph,S,203,true,"atm-3 X-ray callus - FC atm vs. atm Xray",111d,31410901,,84.1500000,,-3.9633545,0.0000000,NO,,1.0329004
SHSVSGDLHGVQPDPIAADILR,ph,S,203,true,"Tissue atlas Arabidopsis - ProteomicsDB",114,32188942,"MaxQuant score",400.4600000,1.0000000,,,,0,
SHSVSGDLHGVQPDPIAADILR,ph,S,205,true,"Conserved plant phosphoproteome - Arabidopsis",61a,20466843,"MASCOT Score",82.0000000,1.0000000,,,,,
SHSVSGDLHGVQPDPIAADILR,ph,S,205,true,"Tissue atlas Arabidopsis - ProteomicsDB",114,32188942,"MaxQuant score",100.6600000,0.9779600,,,,3.875779905349E-12,
KEPEQETFVR,ub,K,223,true,"Arabidopsis ubiquitination COFRADIC",40,26744219,"MaxQuant Score",49.3000000,1.0000000,,,,0.003000000026077,0.1320000
EVISDPSTPKPNTEPFAHYPQGK,ph,S,276,true,"Phospho cell culture sucrose/TOR",109,30833711,,,0.9999890,,,,,
EVISDPSTPKPNTEPFAHYPQGK,ph,S,276,true,"Tissue atlas Arabidopsis - ProteomicsDB",114,32188942,"MaxQuant score",226.9000000,1.0000000,,,,0,
EVISDPSTPKPNTEPFAHYPQGK,ph,S,279,true,"Chloroplast kinase substrates",60,19376835,"MASCOT Score",37.2500000,,,,,,-1.5553500
EVISDPSTPKPNTEPFAHYPQGK,ph,S,279,true,"Lateral root-induction - NAA vs control",106,23328941,"MASCOT Score",25.0000000,,,,,,
EVISDPSTPKPNTEPFAHYPQGK,ph,T,280,true,"TOR Kinase and ABA Receptor",100,29290610,XCorr,3.9929159,0.8563000,,,,1.6050000340329E-5,
EVISDPSTPKPNTEPFAHYPQGK,ph,T,280,true,"Lateral root-induction - NAA vs control",106,23328941,"MASCOT Score",22.0000000,,,,,,
EVISDPSTPKPNTEPFAHYPQGK,ph,T,280,true,"Phospho cell culture sucrose/TOR",109,30833711,,,0.9632590,,,,,
EVISDPSTPKPNTEPFAHYPQGK,ph,T,280,true,"Col-0 callus - FC Col-0 vs. Col-0 Xray",111a,31410901,,33.4000000,,0.3416326,0.0000000,NO,,1.0144963
EVISDPSTPKPNTEPFAHYPQGK,ph,T,280,true,"Col-0 X-ray callus - FC Col-0 vs. Col-0 Xray",111b,31410901,,33.4000000,,0.3416326,0.0000000,NO,,1.0144963
EVISDPSTPKPNTEPFAHYPQGK,ph,T,280,true,"atm callus - FC atm vs. atm Xray",111c,31410901,,33.4000000,,0.8861685,0.0000000,NO,,1.0144963
EVISDPSTPKPNTEPFAHYPQGK,ph,T,280,true,"atm-3 X-ray callus - FC atm vs. atm Xray",111d,31410901,,33.4000000,,0.8861685,0.0000000,NO,,1.0144963
EVISDPSTPKPNTEPFAHYPQGK,ph,T,280,true,"Tissue atlas Arabidopsis - ProteomicsDB",114,32188942,"MaxQuant score",251.5100000,0.9971670,,,,0,
KVDTHVHHSACMNQK,ph,S,395,true,"Tissue atlas Arabidopsis - ProteomicsDB",114,32188942,"MaxQuant score",63.4470000,0.9990690,,,,0.00039502201252617,
VDTHVHHSACMNQK,sno,C,397,true,"hot5-4 / wildtype, FAT-switch S-nitrosoproteome",169,37277371,,,,,,,,
VDTHVHHSACMNQK,so,C,397,true,"Arabidopsis S-sulfenylation chemoproteomics",108,31578252,"pFind PSM Score",0.1397510,,0.7246400,,,,0.7101747
