Peptide,PTM,ModifiedAA,ModifiedPosition,PeptideUniqueToGene,ExperimentDesc,ExpID,PubmedID,ScoreType,IdentScore,LocProb,Log2FChange,PQ-val,QuantSig,PEP,MassErrorPPM
SAVKSLTETELLPITEAD,nt,S,64,true,"HUNTER N-terminome: legumain, GluC and trypsin",119,31951383,"MaxQuant score",145.1700000,,,,,,
AVKSLTETELLPITEAD,nt,A,65,true,"HUNTER N-terminome: legumain, GluC and trypsin",119,31951383,"MaxQuant score",212.5900000,,,,,,
SVPELCGSVK,sno,C,123,true,"hot5-4 / wildtype, FAT-switch S-nitrosoproteome",169,37277371,,,,0.7788733,0.0051231,YES,,
SVPELCGSVK,so,C,123,true,"Arabidopsis S-sulfenylation chemoproteomics",108,31578252,"pFind PSM Score",0.2208840,,0.9803900,,,,0.3382604
VGIVEEPDKAVLTQAWK,ac,K,136,true,"Histone deacetylases substrates - hda14 vs WT",98e,29061669,"MaxQuant Score",82.6000000,1.0000000,0.4240000,0.7328245,NO,2.0000000267029E-10,
SAPQCGFSQR,ox,C,219,true,"OxiTRAQ Arabidopsis - 5 mM H2O2 versus control",47,24376095,,,,0.5357399,0.0517149,NO,,
SAPQCGFSQR,sno,C,219,true,"hot5-4 / wildtype, FAT-switch S-nitrosoproteome",169,37277371,,,,0.2445314,0.1083085,NO,,
SAPQCGFSQR,so,C,219,true,"S-sulfenylation site detection using YAP1C",110,32714340,,,,,,,,
