Peptide,PTM,ModifiedAA,ModifiedPosition,PeptideUniqueToGene,ExperimentDesc,ExpID,PubmedID,ScoreType,IdentScore,LocProb,Log2FChange,PQ-val,QuantSig,PEP,MassErrorPPM
AGIVTEPWSVAENGNPSITAKGSSR,nt,A,2,true,"N-terminal ChaFRADIC",92,26010716,"MASCOT Score",36.9900000,,,,,2.061999992975E-8,
AGIVTEPWSVAENGNPSITAKGSSR,nta,A,2,true,"N-terminal ChaFRADIC",92,26010716,"MASCOT Score",36.9900000,,,,,2.061999992975E-8,
AGIVTEPWSVAENGNPSITAKGSSR,nta,A,2,true,"HUNTER N-terminome: legumain, GluC and trypsin",119,31951383,"MaxQuant score",83.0900000,,,,,,
AGIVTEPWSVAENGNPSITAK,nta,A,2,true,"Characterization plant N-terminal acetylation",6,22223895,"MASCOT Score",54.4100000,,,,,,
AGIVTEPWSVAEN,nta,A,2,true,"HUNTER N-terminome: legumain, GluC and trypsin",119,31951383,"MaxQuant score",202.9600000,,,,,,
TAHNMSSSSLRK,ph,S,38,false,"atm and atr DNA damage response",88,25561503,"MASCOT Score",21.0000000,0.9890000,,,,,-0.8300000
TAHNMSSSSLR,ph,S,38,false,"atm and atr DNA damage response",88,25561503,"MASCOT Score",60.0000000,0.9940000,,,,,0.1000000
TAHNMSSSSLR,ph,S,38,false,"Tissue atlas Arabidopsis - ProteomicsDB",114,32188942,"MaxQuant score",135.8100000,0.9783780,,,,2.1479399947566E-6,
TAHNMSSSSLRK,ph,S,40,false,"atm and atr DNA damage response",88,25561503,"MASCOT Score",33.0000000,0.9780000,,,,,-0.9600000
TAHNMSSSSLR,ph,S,40,false,"atm and atr DNA damage response",88,25561503,"MASCOT Score",51.0000000,0.9850000,,,,,-2.4100000
TAHNMSSSSLR,ph,S,40,false,"Tissue atlas Arabidopsis - ProteomicsDB",114,32188942,"MaxQuant score",169.6000000,0.7521520,,,,1.5138600442666E-11,
TAHNMSSSSLRK,ph,S,41,false,"atm and atr DNA damage response",88,25561503,"MASCOT Score",54.0000000,0.9100000,,,,,-0.3300000
TAHNMSSSSLRK,ph,S,41,false,"TOR Kinase and ABA Receptor",100,29290610,XCorr,3.1282253,0.8049000,,,,0.060559999197721,
TAHNMSSSSLRK,ph,S,41,false,"Tissue atlas Arabidopsis - ProteomicsDB",114,32188942,"MaxQuant score",215.6100000,0.8965650,,,,2.9850300772006E-32,
TAHNMSSSSLR,ph,S,41,false,"atm and atr DNA damage response",88,25561503,"MASCOT Score",61.0000000,0.9960000,,,,,0.3100000
VIQKVPYK,ub,K,53,true,"upl3 mutant / wildtype",168,35926874,"MaxQuant score",58.9170000,1.0000000,-0.2344653,0.0931640,NO,0.012415699660778,0.3457300
