Peptide,PTM,ModifiedAA,ModifiedPosition,PeptideUniqueToGene,ExperimentDesc,ExpID,PubmedID,ScoreType,IdentScore,LocProb,Log2FChange,PQ-val,QuantSig,PEP,MassErrorPPM
QALKDLYTHLTPIQR,nt,Q,138,true,"HUNTER N-terminome: legumain, GluC and trypsin",119,31951383,"MaxQuant score",,,,,,,
NAVFYVASPE,nt,N,311,true,"Arg/N-end rule seed, prt6 vs. Wt",99,29168982,"MASCOT Score",44.2600000,,-0.9218531,0.1065526,NO,0.0064159999601543,-1.4944422
AAPEAAEKLR,ac,K,339,true,"Histone deacetylases - apicidin vs control",98a,29061669,"MaxQuant Score",79.2000000,1.0000000,0.0800000,0.6576578,NO,0.0049999998882413,
AAPEAAEKLR,ac,K,339,true,"Histone deacetylases substrates - hda14 vs WT",98e,29061669,"MaxQuant Score",61.3000000,1.0000000,0.4970000,0.3311311,NO,0.0040000001899898,
AAPEAAEKLR,ac,K,339,true,"Quantitative Acetylproteomics",101,29440448,,,,,,,,
MSGEELLKHR,ac,K,396,true,"Quantitative Acetylproteomics",101,29440448,,,,,,,,
LTDAPNYESLKSK,ac,K,537,true,"Quantitative Acetylproteomics",101,29440448,,,,,,,,
SMGLELDAVK,mox,M,623,true,"cat2 Methionine oxidation - 1h stress",62a,25693801,"MASCOT Score",39.0000000,,-1.6487565,,NO,,
SMGLELDAVK,mox,M,623,true,"cat2 Methionine oxidation - 3h stress",62b,25693801,"MASCOT Score",32.0000000,,-0.1834677,,NO,,
QKDTAEQIYAAN,nt,Q,634,true,"HUNTER N-terminome: legumain, GluC and trypsin",119,31951383,"MaxQuant score",,,,,,,
SMVELLK,mox,M,675,true,"cat2 Methionine oxidation - 1h stress",62a,25693801,"MASCOT Score",40.0000000,,-0.9919191,,NO,,
IEALEQQIKQK,ac,K,707,true,"Quantitative Acetylproteomics",101,29440448,,,,,,,,
ELAAEESDGSVKEDDDDDEDSSESGKSEMVNPSFA,ph,S,741,true,"STN8 phosphoproteome",38,21768351,"MASCOT Score",77.7100000,,,,,,
ELAAEESDGSVKEDDDDDEDSSESGKSEMVNPSFA,ph,S,741,true,"PAMP-triggered phosphorylation",48,24601666,"MASCOT Score",44.5700000,,,,,,
ELAAEESDGSVKEDDDDDEDSSESGKSEMVNPSFA,ph,S,741,true,"Chloroplast kinase substrates",60,19376835,"MASCOT Score",46.7200000,,,,,,-1.0564200
ELAAEESDGSVKEDDDDDEDSSESGKSEMVNPSFA,ph,S,741,true,"srk2dei ABA signaling phopshoproteomics",83,23572148,"MASCOT Score",59.0000000,,,,,,-0.0066000
ELAAEESDGSVKEDDDDDEDSSESGKSEMVNPSFA,ph,S,741,true,"SnRK2 protein kinase substrates",85,23776212,XCorr,4.8952851,0.9900000,,,,4.8019701353041E-6,
ELAAEESDGSVKEDDDDDEDSSESGK,ph,S,741,true,"STN8 phosphoproteome",38,21768351,"MASCOT Score",84.0100000,,,,,,
ELAAEESDGSVKEDDDDDEDSSESGK,ph,S,741,true,"Nitrogen deprivation Ph response",39,22329444,,,,,,,,
ELAAEESDGSVKEDDDDDEDSSESGK,ph,S,741,true,"srk2dei ABA signaling phopshoproteomics",83,23572148,"MASCOT Score",91.0000000,,,,,,-0.0011000
ELAAEESDGSVKEDDDDDEDSSESGK,ph,S,741,true,"LAXIC - ABA stress",84a,23660473,XCorr,6.1000000,1.0000000,,,,3.0999999789394E-10,
ELAAEESDGSVKEDDDDDEDSSESGK,ph,S,741,true,"LAXIC - mannitol vs control",84b,23660473,XCorr,5.5200000,1.0000000,,,,9.8700002126861E-5,
ELAAEESDGSVKEDDDDDEDSSESGK,ph,S,741,true,"SnRK2 protein kinase substrates",85,23776212,XCorr,3.7367902,1.0000000,,,,0.0014829599531367,
ELAAEESDGSVKEDDDDDEDSSESGK,ph,S,741,true,"TOR Kinase and ABA Receptor",100,29290610,XCorr,5.8792028,1.0000000,,,,2.265000063062E-7,
ELAAEESDGSVKEDDDDDEDSSESGK,ph,S,741,true,"Col-0 callus - FC Col-0 vs. Col-0 Xray",111a,31410901,,58.4000000,,-0.3268988,0.0000000,NO,,0.8208802
ELAAEESDGSVKEDDDDDEDSSESGK,ph,S,741,true,"Col-0 X-ray callus - FC Col-0 vs. Col-0 Xray",111b,31410901,,58.4000000,,-0.3268988,0.0000000,NO,,0.8208802
ELAAEESDGSVKEDDDDDEDSSESGK,ph,S,741,true,"atm callus - FC atm vs. atm Xray",111c,31410901,,58.4000000,,-1.1689032,0.0000000,NO,,0.8208802
ELAAEESDGSVKEDDDDDEDSSESGK,ph,S,741,true,"atm-3 X-ray callus - FC atm vs. atm Xray",111d,31410901,,58.4000000,,-1.1689032,0.0000000,NO,,0.8208802
ELAAEESDGSVK,ph,S,741,true,"STN8 phosphoproteome",38,21768351,"MASCOT Score",69.6000000,,,,,,-0.3499530
ELAAEESDGSVK,ph,S,741,true,"Chloroplast kinase substrates",60,19376835,"MASCOT Score",62.9500000,,,,,,-0.7756300
ELAAEESDGSVK,ph,S,741,true,"srk2dei ABA signaling phopshoproteomics",83,23572148,"MASCOT Score",63.0000000,,,,,,0.0000000
ELAAEESDGSVK,ph,S,741,true,"TOR Kinase and ABA Receptor",100,29290610,XCorr,3.7269776,1.0000000,,,,0.0018860000418499,
ELAAEESDGSVK,ph,S,741,true,"Tissue atlas Arabidopsis - ProteomicsDB",114,32188942,"MaxQuant score",197.3600000,1.0000000,,,,1.1582800297934E-24,
ELAAEESDGSVKEDDDDDEDSSESGKSEMVNPSFA,ph,S,744,true,"PAMP-triggered phosphorylation",48,24601666,"MASCOT Score",44.5700000,,,,,,
ELAAEESDGSVKEDDDDDEDSSESGKSEMVNPSFA,ph,S,744,true,"SnRK2 protein kinase substrates",85,23776212,XCorr,4.8952851,0.9660000,,,,4.8019701353041E-6,
ELAAEESDGSVKEDDDDDEDSSESGK,ph,S,744,true,"Nitrogen deprivation Ph response",39,22329444,,,,,,,,
ELAAEESDGSVKEDDDDDEDSSESGK,ph,S,744,true,"srk2dei ABA signaling phopshoproteomics",83,23572148,"MASCOT Score",91.0000000,,,,,,-0.0011000
ELAAEESDGSVKEDDDDDEDSSESGK,ph,S,744,true,"LAXIC - ABA stress",84a,23660473,XCorr,6.1000000,1.0000000,,,,3.0999999789394E-10,
ELAAEESDGSVKEDDDDDEDSSESGK,ph,S,744,true,"LAXIC - mannitol vs control",84b,23660473,XCorr,5.5200000,1.0000000,,,,9.8700002126861E-5,
ELAAEESDGSVKEDDDDDEDSSESGK,ph,S,744,true,"SnRK2 protein kinase substrates",85,23776212,XCorr,4.6856327,0.8600000,,,,4.1599699157746E-16,
ELAAEESDGSVKEDDDDDEDSSESGK,ph,S,744,true,"TOR Kinase and ABA Receptor",100,29290610,XCorr,5.8792028,1.0000000,,,,2.265000063062E-7,
ELAAEESDGSVKEDDDDDEDSSESGK,ph,S,744,true,"Col-0 callus - FC Col-0 vs. Col-0 Xray",111a,31410901,,56.6300000,,2.2340191,0.0000000,NO,,1.5629288
ELAAEESDGSVKEDDDDDEDSSESGK,ph,S,744,true,"Col-0 X-ray callus - FC Col-0 vs. Col-0 Xray",111b,31410901,,56.6300000,,2.2340191,0.0000000,NO,,1.5629288
ELAAEESDGSVKEDDDDDEDSSESGK,ph,S,744,true,"atm callus - FC atm vs. atm Xray",111c,31410901,,56.6300000,,-4.6768960,0.0000000,NO,,1.5629288
ELAAEESDGSVKEDDDDDEDSSESGK,ph,S,744,true,"atm-3 X-ray callus - FC atm vs. atm Xray",111d,31410901,,56.6300000,,-4.6768960,0.0000000,NO,,1.5629288
ELAAEESDGSVK,ph,S,744,true,"srk2dei ABA signaling phopshoproteomics",83,23572148,"MASCOT Score",29.0000000,,,,,,0.0001000
ELAAEESDGSVK,ph,S,744,true,"TOR Kinase and ABA Receptor",100,29290610,XCorr,3.7269776,1.0000000,,,,0.0018860000418499,
ELAAEESDGSVK,ph,S,744,true,"Tissue atlas Arabidopsis - ProteomicsDB",114,32188942,"MaxQuant score",133.0400000,1.0000000,,,,2.0471699826885E-5,
