Peptide,PTM,ModifiedAA,ModifiedPosition,PeptideUniqueToGene,ExperimentDesc,ExpID,PubmedID,ScoreType,IdentScore,LocProb,Log2FChange,PQ-val,QuantSig,PEP,MassErrorPPM
YLIGVGSYDITGPAADVN,nt,Y,26,true,"HUNTER N-terminome: legumain, GluC and trypsin",119,31951383,"MaxQuant score",149.3800000,,,,,,
MAVELFNK,mox,M,383,true,"cat2 Methionine oxidation - 1h stress",62a,25693801,"MASCOT Score",41.0000000,,0.3519565,,NO,,
MAVELFNK,mox,M,383,true,"cat2 Methionine oxidation - 3h stress",62b,25693801,"MASCOT Score",41.0000000,,-0.0277886,,NO,,
GDDQGNVFWR,nt,G,452,true,"HUNTER N-terminome: legumain, GluC and trypsin",119,31951383,"MaxQuant score",49.4180000,,,,,,
RGQQVNATFWSGCPR,ng,N,657,true,"Conserved N-glycosylation",74,22633491,"MaxQuant Score",187.4700000,1.0000000,,,,1.3080000125701E-38,-0.1680000
RGQQVNATFWSGCPR,ng,N,657,true,"N-Glycopeptide Profiling in Arabidopsis Infloresce",132,27067053,"MOWSE score",38.8000000,,,,,4.5000000682194E-5,
RGQQVNATFWSGCPR,ng,N,657,true,"UDP-GlcNAc transporter glycopeptide analysis",135,30224661,,,,,,,1.2983805390832E-5,0.2000000
GQQVNATFWSGCPR,ng,N,657,true,"N-linked Glycan Micro-heterogeneity Arabidopsis",134,29237727,,,,,,,,
GQQVNATFWSGCPR,ng,N,657,true,"UDP-GlcNAc transporter glycopeptide analysis",135,30224661,,,,,,,1.899302493058E-9,-0.3000000
