Peptide,PTM,ModifiedAA,ModifiedPosition,PeptideUniqueToGene,ExperimentDesc,ExpID,PubmedID,ScoreType,IdentScore,LocProb,Log2FChange,PQ-val,QuantSig,PEP,MassErrorPPM
MDKPLLSGSEK,ph,S,7,true,"Tissue atlas Arabidopsis - ProteomicsDB",114,32188942,"MaxQuant score",95.6590000,0.8047980,,,,2.4701099391677E-5,
LDSYQYLQR,ph,S,20,true,"Tissue atlas Arabidopsis - ProteomicsDB",114,32188942,"MaxQuant score",105.7900000,0.9997260,,,,2.4078899514279E-6,
CCWGSRPAR,acy,C,112,true,"Arabidopsis S-acylation atlas - Meristem",163a,35681017,,,,,,,,
CCWGSRPAR,acy,C,112,true,"Arabidopsis S-acylation atlas - Hypocotyl",163b,35681017,,,,,,,,
CCWGSRPAR,acy,C,112,true,"Arabidopsis S-acylation atlas - Leaf",163c,35681017,,,,,,,,
CCWGSRPAR,acy,C,112,true,"Arabidopsis S-acylation atlas - Silique",163e,35681017,,,,,,,,
CCWGSRPAR,acy,C,113,true,"Arabidopsis S-acylation atlas - Meristem",163a,35681017,,,,,,,,
CCWGSRPAR,acy,C,113,true,"Arabidopsis S-acylation atlas - Hypocotyl",163b,35681017,,,,,,,,
CCWGSRPAR,acy,C,113,true,"Arabidopsis S-acylation atlas - Leaf",163c,35681017,,,,,,,,
CCWGSRPAR,acy,C,113,true,"Arabidopsis S-acylation atlas - Silique",163e,35681017,,,,,,,,
GLVAHKDGSDTICTNCNGK,ph,S,247,true,"Tissue atlas Arabidopsis - ProteomicsDB",114,32188942,"MaxQuant score",111.9700000,0.8996380,,,,8.7037300977588E-11,
