Peptide,PTM,ModifiedAA,ModifiedPosition,PeptideUniqueToGene,ExperimentDesc,ExpID,PubmedID,ScoreType,IdentScore,LocProb,Log2FChange,PQ-val,QuantSig,PEP,MassErrorPPM
LLHGMGLASNK,ph,S,113,true,"Tissue atlas Arabidopsis - ProteomicsDB",114,32188942,"MaxQuant score",93.1660000,1.0000000,,,,9.8802104275819E-7,
RVVSNAPVVSNGEEK,ph,S,128,true,"Tissue atlas Arabidopsis - ProteomicsDB",114,32188942,"MaxQuant score",68.7890000,0.9999180,,,,0.00050515402108431,
SRSESDIER,ph,S,166,true,"Tissue atlas Arabidopsis - ProteomicsDB",114,32188942,"MaxQuant score",76.7280000,0.9898750,,,,0.010900399647653,
SRSESDIER,ph,S,168,true,"Tissue atlas Arabidopsis - ProteomicsDB",114,32188942,"MaxQuant score",71.1760000,0.8173170,,,,0.0021504799369723,
TYSTICPTR,ph,S,197,true,"Tissue atlas Arabidopsis - ProteomicsDB",114,32188942,"MaxQuant score",158.7900000,0.9996590,,,,8.5571999079548E-5,
ICQYQTPIR,ph,T,211,true,"Tissue atlas Arabidopsis - ProteomicsDB",114,32188942,"MaxQuant score",175.1500000,1.0000000,,,,6.7475797550287E-5,
KFNSYLSK,ph,S,320,true,"Tissue atlas Arabidopsis - ProteomicsDB",114,32188942,"MaxQuant score",93.9280000,0.9999640,,,,0.0046721398830414,
GVAHSMSLR,ph,S,348,true,"Tissue atlas Arabidopsis - ProteomicsDB",114,32188942,"MaxQuant score",66.6630000,0.8988950,,,,0.0042231599800289,
VADKDVSDGSTDSPK,ph,S,357,true,"Tissue atlas Arabidopsis - ProteomicsDB",114,32188942,"MaxQuant score",86.1360000,0.9802690,,,,0.00012057999992976,
VADKDVSDGSTDSPK,ph,S,363,true,"Pollen phosphoproteome Arabidopsis",43,22631563,"MASCOT Score",46.7300000,,,,,,-2.4102100
VADKDVSDGSTDSPK,ph,S,363,true,"Large-scale phosphorylation discovery",44,23111157,XCorr,4.8980000,,,,,,
VADKDVSDGSTDSPK,ph,S,363,true,"Tissue atlas Arabidopsis - ProteomicsDB",114,32188942,"MaxQuant score",266.2400000,0.9997120,,,,0,
RISTSSQPSSTISSPTKEETSATGPTTSNR,ph,S,762,true,"Tissue atlas Arabidopsis - ProteomicsDB",114,32188942,"MaxQuant score",76.9010000,0.7876160,,,,8.6601698034983E-11,
SQIQPEEEAGPELGSSESFR,ph,S,806,true,"Tissue atlas Arabidopsis - ProteomicsDB",114,32188942,"MaxQuant score",86.5460000,1.0000000,,,,4.3091599764011E-6,
FGESPSINTSSR,ph,S,841,true,"Tissue atlas Arabidopsis - ProteomicsDB",114,32188942,"MaxQuant score",235.2100000,0.9999970,,,,0,
FGESPSINTSSR,ph,S,843,true,"Tissue atlas Arabidopsis - ProteomicsDB",114,32188942,"MaxQuant score",149.5700000,0.9999410,,,,6.6211799776283E-7,
