Peptide,PTM,ModifiedAA,ModifiedPosition,PeptideUniqueToGene,ExperimentDesc,ExpID,PubmedID,ScoreType,IdentScore,LocProb,Log2FChange,PQ-val,QuantSig,PEP,MassErrorPPM
MAMMTTTTTT,nta,M,1,true,"N-term acetylation drought responses",5,26184543,,,,,,,,
VSAAATTEPLTVLVTGAGGR,nt,V,68,true,"Stromal N-terminome",96,26371235,"MASCOT Score",39.4700000,,,,,,
VSAAATTEPLTVLVTGAGGR,nta,V,68,true,"Stromal N-terminome",96,26371235,"MASCOT Score",39.4700000,,,,,,
SAAATTEPLTVLVTGAGGR,nt,S,69,true,"Metacaspase9 substrates - Col-0 / mc9",51a,23964026,"MASCOT Score",83.0000000,,1.1207132,,NO,,-2.2764140
SAAATTEPLTVLVTGAGGR,nt,S,69,true,"N-terminal ChaFRADIC",92,26010716,"MASCOT Score",58.0300000,,,,,1.5199999462215E-12,
SAAATTEPLTVLVTGAGGR,nt,S,69,true,"Stromal N-terminome",96,26371235,"MASCOT Score",31.8000000,,,,,,
SAAATTEPLTVLVTGAGGR,nt,S,69,true,"HUNTER N-terminome: legumain, GluC and trypsin",119,31951383,"MaxQuant score",79.4660000,,,,,,
SAAATTEPLTVLVTGAGGR,nta,S,69,true,"N-terminal ChaFRADIC",92,26010716,"MASCOT Score",56.8600000,,,,,0.00011580000136746,
AAATTEPLTVLVTGAGGR,nt,A,70,true,"Tic56 chloroplast import - wild-type",89a,25588737,XCorr,4.3170457,,,,,,
AAATTEPLTVLVTGAGGR,nt,A,70,true,"Tic56 chloroplast import - ppi2",89b,25588737,XCorr,4.3688512,,,,,,
AAATTEPLTVLVTGAGGR,nt,A,70,true,"Tic56 chloroplast import - tic56-1",89c,25588737,XCorr,4.7085061,,,,,,
AAATTEPLTVLVTGAGGR,nt,A,70,true,"N-terminal ChaFRADIC",92,26010716,"MASCOT Score",97.9100000,,,,,2.024000025358E-7,
AAATTEPLTVLVTGAGGR,nt,A,70,true,"Stromal N-terminome",96,26371235,"MASCOT Score",124.4400000,,,,,,
AAATTEPLTVLVTGAGGR,nt,A,70,true,"Arg/N-end rule seed, prt6 vs. Wt",99,29168982,"MASCOT Score",85.1200000,,-0.1379879,0.4968143,NO,8.762000106799E-6,-1.4617384
AAATTEPLTVLVTGAGGR,nt,A,70,true,"HUNTER N-terminome: legumain, GluC and trypsin",119,31951383,"MaxQuant score",279.7700000,,,,,,
AAATTEPLTVLVTGAGGR,nt,A,70,true,"Arabidopsis translation initiation landscape - NT",167b,35069635,,,,,,,,
AAATTEPLTVLVTGAGGR,nta,A,70,true,"Characterization plant N-terminal acetylation",6,22223895,"MASCOT Score",74.7900000,,,,,,
AAATTEPLTVLVTGAGGR,nta,A,70,true,"Tic56 chloroplast import - wild-type",89a,25588737,XCorr,3.3796580,,,,,,
AAATTEPLTVLVTGAGGR,nta,A,70,true,"Tic56 chloroplast import - ppi2",89b,25588737,XCorr,4.3257332,,,,,,
AAATTEPLTVLVTGAGGR,nta,A,70,true,"Tic56 chloroplast import - tic56-1",89c,25588737,XCorr,3.3208911,,,,,,
AAATTEPLTVLVTGAGGR,nta,A,70,true,"N-terminal ChaFRADIC",92,26010716,"MASCOT Score",97.9100000,,,,,2.024000025358E-7,
AAATTEPLTVLVTGAGGR,nta,A,70,true,"Stromal N-terminome",96,26371235,"MASCOT Score",77.7600000,,,,,,
AAATTEPLTVLVTGAGGR,nta,A,70,true,"FtsH12 N-terminome: WT / FtsH12 knockdown miRNA",118,33216923,"MaxQuant score",72.4960000,,,,,7.999999797903E-5,
AAATTEPLTVLVTGAGGR,nta,A,70,true,"HUNTER N-terminome: legumain, GluC and trypsin",119,31951383,"MaxQuant score",125.5300000,,,,,,
AATTEPLTVLVTGAGGR,nt,A,71,true,"Arg/N-end rule pathway Roots",80,25728785,"MASCOT Score",57.2000000,,,,,1.068999972631E-5,
AATTEPLTVLVTGAGGR,nt,A,71,true,"Tic56 chloroplast import - wild-type",89a,25588737,XCorr,4.5991554,,,,,,
AATTEPLTVLVTGAGGR,nt,A,71,true,"Tic56 chloroplast import - ppi2",89b,25588737,XCorr,4.5600457,,,,,,
AATTEPLTVLVTGAGGR,nt,A,71,true,"Tic56 chloroplast import - tic56-1",89c,25588737,XCorr,4.7174387,,,,,,
AATTEPLTVLVTGAGGR,nt,A,71,true,"N-terminal ChaFRADIC",92,26010716,"MASCOT Score",87.8000000,,,,,1.8999999440439E-7,
AATTEPLTVLVTGAGGR,nt,A,71,true,"Stromal N-terminome",96,26371235,"MASCOT Score",125.2800000,,,,,,
AATTEPLTVLVTGAGGR,nt,A,71,true,"Arg/N-end rule seed, prt6 vs. Wt",99,29168982,"MASCOT Score",66.1200000,,0.1253505,0.4145384,NO,0.0020870000589639,-1.2546775
AATTEPLTVLVTGAGGR,nt,A,71,true,"HUNTER N-terminome: legumain, GluC and trypsin",119,31951383,"MaxQuant score",279.1200000,,,,,,
AATTEPLTVLVTGAGGR,nt,A,71,true,"Arabidopsis translation initiation landscape - NT",167b,35069635,,,,,,,,
AATTEPLTVL,nt,A,71,true,"N-terminal ChaFRADIC",92,26010716,"MASCOT Score",56.0300000,,,,,2.0470000094974E-7,
AATTEPLTVLVTGAGGR,nta,A,71,true,"Characterization plant N-terminal acetylation",6,22223895,"MASCOT Score",74.6900000,,,,,,
AATTEPLTVLVTGAGGR,nta,A,71,true,"Tic56 chloroplast import - wild-type",89a,25588737,XCorr,3.5878663,,,,,,
AATTEPLTVLVTGAGGR,nta,A,71,true,"Tic56 chloroplast import - ppi2",89b,25588737,XCorr,3.4756575,,,,,,
AATTEPLTVLVTGAGGR,nta,A,71,true,"N-terminal ChaFRADIC",92,26010716,"MASCOT Score",87.8000000,,,,,1.8999999440439E-7,
AATTEPLTVLVTGAGGR,nta,A,71,true,"Stromal N-terminome",96,26371235,"MASCOT Score",70.3700000,,,,,,
AATTEPLTVLVTGAGGR,nta,A,71,true,"Arg/N-end rule seed, prt6 vs. Wt",99,29168982,"MASCOT Score",57.8100000,,,,,0.0016680000117049,-2.1852297
AATTEPLTVLVTGAGGR,nta,A,71,true,"FtsH12 N-terminome: WT / FtsH12 knockdown miRNA",118,33216923,"MaxQuant score",41.4480000,,,,,0.0045921001583338,
AATTEPLTVLVTGAGGR,nta,A,71,true,"HUNTER N-terminome: legumain, GluC and trypsin",119,31951383,"MaxQuant score",212.5900000,,,,,,
AATTEPLTVLVTGAGGR,nta,A,71,true,"Arabidopsis translation initiation landscape - NTA",167a,35069635,,,,,,,,
ATTEPLTVLVTGAGGR,nt,A,72,true,"Tic56 chloroplast import - ppi2",89b,25588737,XCorr,3.7835941,,,,,,
ATTEPLTVLVTGAGGR,nt,A,72,true,"N-terminal ChaFRADIC",92,26010716,"MASCOT Score",56.9100000,,,,,5.1480000706761E-8,
ATTEPLTVLVTGAGGR,nt,A,72,true,"Stromal N-terminome",96,26371235,"MASCOT Score",83.2800000,,,,,,
ATTEPLTVLVTGAGGR,nt,A,72,true,"HUNTER N-terminome: legumain, GluC and trypsin",119,31951383,"MaxQuant score",56.0870000,,,,,,
TTEPLTVLVTGAGGR,nt,T,73,true,"Tic56 chloroplast import - wild-type",89a,25588737,XCorr,3.6228857,,,,,,
TTEPLTVLVTGAGGR,nt,T,73,true,"N-terminal ChaFRADIC",92,26010716,"MASCOT Score",59.7700000,,,,,2.1619999124312E-9,
TTEPLTVLVTGAGGR,nt,T,73,true,"Stromal N-terminome",96,26371235,"MASCOT Score",116.1800000,,,,,,
TTEPLTVLVTGAGGR,nt,T,73,true,"Arg/N-end rule seed, prt6 vs. Wt",99,29168982,"MASCOT Score",80.9200000,,-0.0193352,0.9522849,NO,0.0002665999927558,-0.4140363
TTEPLTVLVTGAGGR,nt,T,73,true,"HUNTER N-terminome: legumain, GluC and trypsin",119,31951383,"MaxQuant score",98.1560000,,,,,,
TGQIVYKK,ac,K,94,false,"Lysine acetylation gel-based Finkemeier et al",37,21311031,i-probability,0.6197860,,,,,,
SEQFVAR,nt,S,100,true,"N-terminal ChaFRADIC",92,26010716,"MASCOT Score",20.3600000,,,,,0.0037030000239611,
QIDAAKAAGVKQIVLVGSMGGTN,nt,Q,188,true,"HUNTER N-terminome: legumain, GluC and trypsin",119,31951383,"MaxQuant score",,,,,,,
KAEQYLADSGIPYTIIR,ub,K,229,true,"Arabidopsis ubiquitination COFRADIC",40,26744219,"MaxQuant Score",78.0780000,1.0000000,,,,1.2049999886798E-9,0.5140000
AGGLQDKDGGIR,ac,K,252,true,"Histone deacetylases - apicidin vs control",98a,29061669,"MaxQuant Score",116.2000000,1.0000000,-0.1770000,0.3597493,NO,5.6999997983306E-15,
AGGLQDKDGGIR,ac,K,252,true,"Histone deacetylases substrates - TSA vs control",98b,29061669,"MaxQuant Score",116.2000000,1.0000000,0.3140000,0.9527962,NO,5.6999997983306E-15,
AGGLQDKDGGIR,ac,K,252,true,"Histone deacetylases- hda14 vs WT (low light)",98c,29061669,"MaxQuant Score",76.7600000,1.0000000,-0.0200000,0.9931160,NO,0.037000000476837,
AGGLQDKDGGIR,ac,K,252,true,"Histone deacetylases substrates - hda14 vs WT",98e,29061669,"MaxQuant Score",262.1000000,1.0000000,-0.1740000,0.8709636,NO,0,
AGGLQDKDGGIR,ac,K,252,true,"Quantitative Acetylproteomics",101,29440448,,,,,,,,
AGGLQDKDGGIR,ub,K,252,true,"Arabidopsis ubiquitination COFRADIC",40,26744219,"MaxQuant Score",134.5600000,1.0000000,,,,7.1459999376189E-12,-0.0190000
ELLVGKDDELLETETR,nt,E,258,true,"Metacaspase9 substrates - in vitro rMC9",51c,23964026,"MASCOT Score",92.0000000,,5.3678333,,NO,,-1.2506012
ELLVGKDDELLETETR,nt,E,258,true,"Stromal N-terminome",96,26371235,"MASCOT Score",36.1200000,,,,,,
ELLVGKDDELLETETR,ac,K,263,true,"Histone deacetylases substrates - hda14 vs WT",98e,29061669,"MaxQuant Score",73.3000000,1.0000000,-0.0520000,0.9705100,NO,1.399999973728E-6,
ELLVGKDDELLETETR,ub,K,263,true,"Arabidopsis ubiquitination COFRADIC",40,26744219,"MaxQuant Score",102.0800000,1.0000000,,,,1.7949999026469E-21,0.0160000
ADVAEVCVQALQLEEAK,sno,C,284,true,"Cold stress nitrosylation - 4°C vs 22°C",65,24388526,,,,,,,,
ADVAEVCVQALQLEEAK,sno,C,284,true,"Site-specific nitrosomeproteomic id - gsnor1-3",90b,25699590,XCorr,2.9900000,,,,,0.00033929999335669,-7.2200000
VQALQLE,nt,V,285,true,"Arg/N-end rule seed, prt6 vs. Wt",99,29168982,"MASCOT Score",64.0300000,,-0.3013682,0.0489324,NO,0.05451999977231,1.8678475
ALDLASKPEGTGTPTK,ph,S,302,true,"srk2dei ABA signaling phopshoproteomics",83,23572148,"MASCOT Score",33.0000000,,,,,,-0.0002000
ALDLASKPEGTGTPTK,ac,K,303,true,"Histone deacetylases - apicidin vs control",98a,29061669,"MaxQuant Score",72.9000000,1.0000000,0.0580000,0.8472274,NO,4.6999999447905E-9,
ALDLASKPEGTGTPTKDFK,ph,T,307,true,"Phosphoproteome ethylene-regulated time response",46,24043427,"MASCOT Score",66.9600000,,,,,,-14.0557000
ALDLASKPEGTGTPTKDFK,ph,T,307,true,"Tissue atlas Arabidopsis - ProteomicsDB",114,32188942,"MaxQuant score",222.2100000,0.9933360,,,,0,
ALDLASKPEGTGTPTK,ph,T,307,true,"STN8 phosphoproteome",38,21768351,"MASCOT Score",51.2800000,,,,,,-0.9673420
ALDLASKPEGTGTPTK,ph,T,307,true,"srk2dei ABA signaling phopshoproteomics",83,23572148,"MASCOT Score",73.0000000,,,,,,0.0002000
ALDLASKPEGTGTPTK,ph,T,307,true,"atm and atr DNA damage response",88,25561503,"MASCOT Score",63.0000000,0.9410000,,,,,-1.6300000
ALDLASKPEGTGTPTK,ph,T,307,true,"Protein sumoylation and phosphorylation cross-talk",97,28419593,,,,,,,,
ALDLASKPEGTGTPTK,ph,T,307,true,"Phospho cell culture sucrose/TOR",109,30833711,,,0.9954240,,,,,
ALDLASKPEGTGTPTKDFK,ph,T,309,true,"Phosphoproteome ethylene-regulated time response",46,24043427,"MASCOT Score",42.0600000,,,,,,4.0200000
ALDLASKPEGTGTPTKDFK,ph,T,309,true,"SnRK2 protein kinase substrates",85,23776212,XCorr,2.8626010,0.7900000,,,,0.00083924102364108,
ALDLASKPEGTGTPTKDFK,ph,T,309,true,"Tissue atlas Arabidopsis - ProteomicsDB",114,32188942,"MaxQuant score",226.2400000,0.9651200,,,,0,
ALDLASKPEGTGTPTK,ph,T,309,true,"Chloroplast kinase substrates",60,19376835,"MASCOT Score",37.4100000,,,,,,-0.4753870
ALDLASKPEGTGTPTK,ph,T,309,true,"srk2dei ABA signaling phopshoproteomics",83,23572148,"MASCOT Score",43.0000000,,,,,,0.0000000
ALDLASKPEGTGTPTK,ph,T,309,true,"atm and atr DNA damage response",88,25561503,"MASCOT Score",37.0000000,0.9460000,,,,,-1.6400000
ALDLASKPEGTGTPTK,ph,T,309,true,"TOR Kinase and ABA Receptor",100,29290610,XCorr,4.9044318,0.9995000,,,,9.4620000723467E-10,
ALDLASKPEGTGTPTK,ph,T,311,true,"srk2dei ABA signaling phopshoproteomics",83,23572148,"MASCOT Score",40.0000000,,,,,,-0.0014000
ALDLASKPEGTGTPTKDFK,ac,K,312,true,"Quantitative Acetylproteomics",101,29440448,,,,,,,,
ALFTQVTTKF,ph,T,322,true,"Tissue atlas Arabidopsis - ProteomicsDB",114,32188942,"MaxQuant score",122.5100000,0.8854370,,,,0.00028493299032561,
