Peptide,PTM,ModifiedAA,ModifiedPosition,PeptideUniqueToGene,ExperimentDesc,ExpID,PubmedID,ScoreType,IdentScore,LocProb,Log2FChange,PQ-val,QuantSig,PEP,MassErrorPPM
SVTMDSWSEIQIK,ph,S,63,true,"Tissue atlas Arabidopsis - ProteomicsDB",114,32188942,"MaxQuant score",161.2100000,0.9961690,,,,9.829709962661E-11,
ESVGGGLMNK,ph,S,129,true,"Tissue atlas Arabidopsis - ProteomicsDB",114,32188942,"MaxQuant score",170.1600000,1.0000000,,,,6.2087597751801E-19,
ESVGGGLMNK,mox,M,135,true,"cat2 Methionine oxidation - 1h stress",62a,25693801,"MASCOT Score",32.0000000,,-1.4526734,,NO,,
KPPLSQGGGR,ph,S,142,true,"Tissue atlas Arabidopsis - ProteomicsDB",114,32188942,"MaxQuant score",86.1910000,1.0000000,,,,1.4210100008846E-15,
RNQSAGDFR,ph,S,173,true,"Chloroplast kinase substrates",60,19376835,"MASCOT Score",39.0400000,,,,,,-1.8041700
RNQSAGDFR,ph,S,173,true,"atm and atr DNA damage response",88,25561503,"MASCOT Score",43.0000000,1.0000000,,,,,-0.4900000
RNQSAGDFR,ph,S,173,true,"Phospho cell culture sucrose/TOR",109,30833711,,,1.0000000,,,,,
RNQSAGDFR,ph,S,173,true,"Tissue atlas Arabidopsis - ProteomicsDB",114,32188942,"MaxQuant score",145.7500000,1.0000000,,,,0.00017020500672515,
NQSAGDFR,ph,S,173,true,"STN8 phosphoproteome",38,21768351,"MASCOT Score",41.6100000,,,,,,-0.3612770
NQSAGDFR,ph,S,173,true,"Chloroplast kinase substrates",60,19376835,"MASCOT Score",38.5000000,,,,,,-0.3612770
NQSAGDFR,ph,S,173,true,"LAXIC - mannitol vs control",84b,23660473,XCorr,2.5700000,1.0000000,,,,0.0064641800709069,
NQSAGDFR,ph,S,173,true,"SnRK2 protein kinase substrates",85,23776212,XCorr,2.4167604,1.0000000,,,,0.012954199686646,
NQSAGDFR,ph,S,173,true,"atm and atr DNA damage response",88,25561503,"MASCOT Score",48.0000000,1.0000000,,,,,0.2600000
NQSAGDFR,ph,S,173,true,"Protein sumoylation and phosphorylation cross-talk",97,28419593,,,,,,,,
NQSAGDFR,ph,S,173,true,"TOR Kinase and ABA Receptor",100,29290610,XCorr,2.8914628,1.0000000,,,,0.0038129999302328,
NQSAGDFR,ph,S,173,true,"Lateral root-induction - NAA vs control",106,23328941,"MASCOT Score",34.0000000,,,,,,
NQSAGDFR,ph,S,173,true,"Col-0 callus - FC Col-0 vs. Col-0 Xray",111a,31410901,,28.5000000,,0.1232259,0.0000000,NO,,-0.0328080
NQSAGDFR,ph,S,173,true,"Col-0 X-ray callus - FC Col-0 vs. Col-0 Xray",111b,31410901,,28.5000000,,0.1232259,0.0000000,NO,,-0.0328080
NQSAGDFR,ph,S,173,true,"atm callus - FC atm vs. atm Xray",111c,31410901,,28.5000000,,-0.8599155,0.0000000,NO,,-0.0328080
NQSAGDFR,ph,S,173,true,"atm-3 X-ray callus - FC atm vs. atm Xray",111d,31410901,,28.5000000,,-0.8599155,0.0000000,NO,,-0.0328080
SKSSEDIYSR,ph,S,189,true,"Tyrosine phosphorylation in Arabidopsis",59,18463617,"MASCOT Score",48.0000000,,,,,,-0.9596032
SKSSEDIYSR,ph,S,189,true,"srk2dei ABA signaling phopshoproteomics",83,23572148,"MASCOT Score",30.0000000,,,,,,0.0003000
SKSSEDIYSR,ph,S,189,true,"LAXIC - mannitol vs control",84b,23660473,XCorr,3.3100000,0.9720000,,,,0.00050896499305964,
SKSSEDIYSR,ph,S,189,true,"Tissue atlas Arabidopsis - ProteomicsDB",114,32188942,"MaxQuant score",71.9330000,0.8533830,,,,0.0037748699542135,
SKSSEDIYSR,ph,S,191,true,"Ethylene-regulated phosphorylation ein2 mutant",30,19253305,"MASCOT Score",61.4035000,,,,,,19.3279300
SKSSEDIYSR,ph,S,191,true,"STN8 phosphoproteome",38,21768351,"MASCOT Score",40.7400000,,,,,,0.0851216
SKSSEDIYSR,ph,S,191,true,"Phosphoproteome ethylene-regulated time response",46,24043427,"MASCOT Score",54.8000000,,,,,,-6.9152000
SKSSEDIYSR,ph,S,191,true,"Tyrosine phosphorylation in Arabidopsis",59,18463617,"MASCOT Score",42.0000000,,,,,,-0.4798014
SKSSEDIYSR,ph,S,191,true,"Chloroplast kinase substrates",60,19376835,"MASCOT Score",31.7700000,,,,,,-1.1443900
SKSSEDIYSR,ph,S,191,true,"LAXIC - ABA stress",84a,23660473,XCorr,2.8200000,0.8970000,,,,0.20293299853802,
SKSSEDIYSR,ph,S,191,true,"SnRK2 protein kinase substrates",85,23776212,XCorr,3.1743028,0.9990000,,,,0.03824819996953,
SKSSEDIYSR,ph,S,191,true,"atm and atr DNA damage response",88,25561503,"MASCOT Score",46.0000000,0.9560000,,,,,-0.9400000
SKSSEDIYSR,ph,S,191,true,"Protein sumoylation and phosphorylation cross-talk",97,28419593,,,,,,,,
SKSSEDIYSR,ph,S,191,true,"Phospho cell culture sucrose/TOR",109,30833711,,,0.9999640,,,,,
SKSSEDIYSR,ph,S,191,true,"Col-0 callus - FC Col-0 vs. Col-0 Xray",111a,31410901,,44.4500000,,-0.5713001,0.0000000,NO,,0.4914565
SKSSEDIYSR,ph,S,191,true,"Col-0 X-ray callus - FC Col-0 vs. Col-0 Xray",111b,31410901,,44.4500000,,-0.5713001,0.0000000,NO,,0.4914565
SKSSEDIYSR,ph,S,191,true,"atm callus - FC atm vs. atm Xray",111c,31410901,,44.4500000,,-1.6507553,0.0000000,NO,,0.4914565
SKSSEDIYSR,ph,S,191,true,"atm-3 X-ray callus - FC atm vs. atm Xray",111d,31410901,,44.4500000,,-1.6507553,0.0000000,NO,,0.4914565
SKSSEDIYSR,ph,S,191,true,"Tissue atlas Arabidopsis - ProteomicsDB",114,32188942,"MaxQuant score",231.6900000,0.9999730,,,,3.123079851367E-36,
SSEDIYSR,ph,S,191,true,"atm and atr DNA damage response",88,25561503,"MASCOT Score",36.0000000,0.9540000,,,,,-0.3900000
SKSSEDIYSR,ph,S,192,true,"atm and atr DNA damage response",88,25561503,"MASCOT Score",25.0000000,0.8900000,,,,,-0.3400000
SKSSEDIYSR,ph,S,192,true,"Tissue atlas Arabidopsis - ProteomicsDB",114,32188942,"MaxQuant score",112.7100000,0.9941520,,,,0.00010226399899693,
SQLEASAANK,ph,S,199,true,"Tissue atlas Arabidopsis - ProteomicsDB",114,32188942,"MaxQuant score",100.1900000,0.9999990,,,,0.00042792200110853,
YVGFGSSPGPAPR,ph,S,239,true,"Lateral root-induction - NAA vs control",106,23328941,"MASCOT Score",27.0000000,,,,,,
YVGFGSSPGPAPR,ph,S,239,true,"Tissue atlas Arabidopsis - ProteomicsDB",114,32188942,"MaxQuant score",123.9500000,0.9461320,,,,6.5499698393978E-5,
YVGFGSSPGPAPR,ph,S,240,true,"Large-scale phosphorylation discovery",44,23111157,XCorr,4.1380000,,,,,,
YVGFGSSPGPAPR,ph,S,240,true,"Phosphoproteome ethylene-regulated time response",46,24043427,"MASCOT Score",44.3700000,,,,,,5.4558000
YVGFGSSPGPAPR,ph,S,240,true,"srk2dei ABA signaling phopshoproteomics",83,23572148,"MASCOT Score",58.0000000,,,,,,0.0010000
YVGFGSSPGPAPR,ph,S,240,true,"LAXIC - mannitol vs control",84b,23660473,XCorr,3.1800000,0.9620000,,,,0.0003729900054168,
YVGFGSSPGPAPR,ph,S,240,true,"SnRK2 protein kinase substrates",85,23776212,XCorr,3.2156372,0.9680000,,,,3.9049200495356E-6,
YVGFGSSPGPAPR,ph,S,240,true,"atm and atr DNA damage response",88,25561503,"MASCOT Score",45.0000000,0.9900000,,,,,-0.0400000
YVGFGSSPGPAPR,ph,S,240,true,"Lateral root-induction - NAA vs control",106,23328941,"MASCOT Score",34.0000000,,0.1440676,0.6100861,NO,,
YVGFGSSPGPAPR,ph,S,240,true,"Col-0 callus - FC Col-0 vs. Col-0 Xray",111a,31410901,,71.4100000,,0.4655561,0.0000000,NO,,0.2955621
YVGFGSSPGPAPR,ph,S,240,true,"Col-0 X-ray callus - FC Col-0 vs. Col-0 Xray",111b,31410901,,71.4100000,,0.4655561,0.0000000,NO,,0.2955621
YVGFGSSPGPAPR,ph,S,240,true,"atm callus - FC atm vs. atm Xray",111c,31410901,,71.4100000,,-0.1720608,0.0000000,NO,,0.2955621
YVGFGSSPGPAPR,ph,S,240,true,"atm-3 X-ray callus - FC atm vs. atm Xray",111d,31410901,,71.4100000,,-0.1720608,0.0000000,NO,,0.2955621
YVGFGSSPGPAPR,ph,S,240,true,"Tissue atlas Arabidopsis - ProteomicsDB",114,32188942,"MaxQuant score",202.2900000,0.9981540,,,,1.1648199597703E-38,
TEGNGYYQNSGIGNK,ph,S,357,true,"Tissue atlas Arabidopsis - ProteomicsDB",114,32188942,"MaxQuant score",282.7200000,1.0000000,,,,0,
TANSSFGGSQSSSSGHNNSYR,ph,S,366,true,"atm and atr DNA damage response",88,25561503,"MASCOT Score",87.0000000,1.0000000,,,,,-0.4000000
TANSSFGGSQSSSSGHNNSYR,fuc,S,367,true,"SPINDLY O-fucosylation",162,36739885,,,,,,,0.15000000596046,
TANSSFGGSQSSSSGHNNSYR,ph,S,367,true,"srk2dei ABA signaling phopshoproteomics",83,23572148,"MASCOT Score",33.0000000,,,,,,-0.0002000
TANSSFGGSQSSSSGHNNSYR,ph,S,367,true,"Phospho cell culture sucrose/TOR",109,30833711,,,0.9187810,,,,,
TANSSFGGSQSSSSGHNNSYR,ph,S,367,true,"Tissue atlas Arabidopsis - ProteomicsDB",114,32188942,"MaxQuant score",317.9000000,0.9994900,,,,0,
TANSSFGGSQSSSSGHNNSYR,ph,S,371,true,"TOR Kinase and ABA Receptor",100,29290610,XCorr,5.6338882,0.9595000,,,,2.3180000141565E-9,
TANSSFGGSQSSSSGHNNSYR,ph,S,371,true,"Tissue atlas Arabidopsis - ProteomicsDB",114,32188942,"MaxQuant score",309.4500000,0.9930620,,,,0,
TANSSFGGSQSSSSGHNNSYR,fuc,S,374,true,"SPINDLY O-fucosylation",162,36739885,,,,,,,-0.97000002861023,
TANSSFGGSQSSSSGHNNSYR,ph,S,381,true,"Tissue atlas Arabidopsis - ProteomicsDB",114,32188942,"MaxQuant score",113.7900000,0.9984140,,,,2.6663000691866E-13,
NSNSWDDWGEENNSK,ph,S,385,true,"Large-scale phosphorylation discovery",44,23111157,XCorr,3.2600000,,,,,,
NSNSWDDWGEENNSK,ph,S,385,true,"Tissue atlas Arabidopsis - ProteomicsDB",114,32188942,"MaxQuant score",270.4500000,0.9998480,,,,0,
NSNSWDDWGEENNSKK,ph,S,387,true,"Tissue atlas Arabidopsis - ProteomicsDB",114,32188942,"MaxQuant score",362.0200000,1.0000000,,,,0,
EAAPKVSTSN,nt,E,400,true,"Arabidopsis translation initiation landscape - NT",167b,35069635,,,,,,,,
VSTSNDDDDGGWAGWDDNDAK,ph,S,406,true,"TOR Kinase and ABA Receptor",100,29290610,XCorr,5.5959678,0.9200000,,,,3.3069998295332E-8,
DDDFYYQPASDKK,ph,S,435,true,"Tissue atlas Arabidopsis - ProteomicsDB",114,32188942,"MaxQuant score",214.5800000,1.0000000,,,,0,
