Peptide,PTM,ModifiedAA,ModifiedPosition,PeptideUniqueToGene,ExperimentDesc,ExpID,PubmedID,ScoreType,IdentScore,LocProb,Log2FChange,PQ-val,QuantSig,PEP,MassErrorPPM
FVLEIPKHLSSTGITK,ac,K,123,true,"Histone deacetylases - apicidin vs control",98a,29061669,"MaxQuant Score",73.8000000,1.0000000,0.8920000,0.0103276,YES,0.0010000000474975,
ASFQQSNSMSDR,ph,S,295,true,"Tissue atlas Arabidopsis - ProteomicsDB",114,32188942,"MaxQuant score",78.6150000,0.9051730,,,,0.00050859100883827,
TYAKDTLDEPKR,ac,K,345,true,"Quantitative Acetylproteomics",101,29440448,,,,,,,,
DTLDEPKR,ac,K,345,true,"Histone deacetylases - apicidin vs control",98a,29061669,"MaxQuant Score",134.8000000,1.0000000,0.4070000,0.0744732,NO,0.0010000000474975,
DTLDEPKR,ac,K,345,true,"Histone deacetylases- hda14 vs WT (low light)",98c,29061669,"MaxQuant Score",118.3300000,1.0000000,0.4680000,0.9885531,NO,0.026000000536442,
DTLDEPKR,ac,K,345,true,"Histone deacetylases substrates - hda14 vs WT",98e,29061669,"MaxQuant Score",88.4000000,1.0000000,0.1120000,0.9099133,NO,0.013000000268221,
DTLDEPKR,ac,K,345,true,"Quantitative Acetylproteomics",101,29440448,,,,,,,,
IAKKLTSHVSGTGCHKK,ac,K,349,true,"Histone deacetylases substrates - hda14 vs WT",98e,29061669,"MaxQuant Score",82.0000000,1.0000000,0.4050000,0.5000345,NO,3.9000001145206E-11,
IAKKLTSHVSGTGCHKK,ac,K,350,true,"Histone deacetylases substrates - hda14 vs WT",98e,29061669,"MaxQuant Score",82.0000000,1.0000000,0.4050000,0.5000345,NO,3.9000001145206E-11,
IAKKLTSHVSGTGCHKK,ac,K,362,true,"Histone deacetylases substrates - hda14 vs WT",98e,29061669,"MaxQuant Score",82.0000000,1.0000000,0.4050000,0.5000345,NO,3.9000001145206E-11,
