Peptide,PTM,ModifiedAA,ModifiedPosition,PeptideUniqueToGene,ExperimentDesc,ExpID,PubmedID,ScoreType,IdentScore,LocProb,Log2FChange,PQ-val,QuantSig,PEP,MassErrorPPM
AVATTVEE,nt,A,35,true,"N-terminal ChaFRADIC",92,26010716,"MASCOT Score",38.8600000,,,,,0.043389998376369,
VATTVEEASGNIPAAPISLPQGSWK,nta,V,36,true,"Characterization plant N-terminal acetylation",6,22223895,"MASCOT Score",58.7200000,,,,,,
VATTVEEASGN,nta,V,36,true,"HUNTER N-terminome: legumain, GluC and trypsin",119,31951383,"MaxQuant score",158.5700000,,,,,,
AAGMYAGLRAAGK,mox,M,77,true,"cat2 Methionine oxidation - 3h stress",62b,25693801,"MASCOT Score",32.0000000,,-0.0825199,,NO,,
IRVGGMAK,mox,M,236,true,"cat2 Methionine oxidation - 1h stress",62a,25693801,"MASCOT Score",54.0000000,,0.4414820,,NO,,
IRVGGMAK,mox,M,236,true,"cat2 Methionine oxidation - 3h stress",62b,25693801,"MASCOT Score",37.0000000,,-0.3196461,,NO,,
TMLGVITTDALVESDIWR,nt,T,249,true,"N-terminal ChaFRADIC",92,26010716,"MASCOT Score",64.2400000,,,,,5.6889999378029E-9,
TMLGVITTDALVE,nt,T,249,true,"N-terminal ChaFRADIC",92,26010716,"MASCOT Score",73.9500000,,,,,0.00088080001296476,
