Peptide,PTM,ModifiedAA,ModifiedPosition,PeptideUniqueToGene,ExperimentDesc,ExpID,PubmedID,ScoreType,IdentScore,LocProb,Log2FChange,PQ-val,QuantSig,PEP,MassErrorPPM
GAPRGSRDFDSR,ph,S,86,true,"Phospho cell culture sucrose/TOR",109,30833711,,,0.9988440,,,,,
GSRDFDSR,ph,S,86,true,"atm and atr DNA damage response",88,25561503,"MASCOT Score",26.0000000,1.0000000,,,,,-0.4700000
DFDSRGPPPGAGR,ph,S,91,true,"atm and atr DNA damage response",88,25561503,"MASCOT Score",36.0000000,1.0000000,,,,,0.0000000
DFDSRGPPPGAGR,ph,S,91,true,"TOR Kinase and ABA Receptor",100,29290610,XCorr,2.3808098,1.0000000,,,,0.0077360002323985,
DFDSRGPPPGAGR,ph,S,91,true,"Tissue atlas Arabidopsis - ProteomicsDB",114,32188942,"MaxQuant score",122.9600000,1.0000000,,,,5.0463899242459E-5,
DCTAGDWK,ox,C,114,false,"OxiTRAQ Arabidopsis - 5 mM H2O2 versus control",47,24376095,,,,-0.0472438,0.7349455,NO,,
DCTAGDWK,sno,C,114,false,"hot5-4 / wildtype, FAT-switch S-nitrosoproteome",169,37277371,,,,,,,,
SGSYSRSPVR,ph,S,148,true,"atm and atr DNA damage response",88,25561503,"MASCOT Score",26.0000000,0.9920000,,,,,0.3500000
SGSYSRSPVR,ph,S,148,true,"Tissue atlas Arabidopsis - ProteomicsDB",114,32188942,"MaxQuant score",105.6500000,0.7990110,,,,7.1436501457356E-5,
SGSYSRSPVR,ph,S,150,true,"Tissue atlas Arabidopsis - ProteomicsDB",114,32188942,"MaxQuant score",109.1500000,0.9704440,,,,5.840640005772E-5,
SGSYSRSPVR,ph,S,152,true,"atm and atr DNA damage response",88,25561503,"MASCOT Score",26.0000000,1.0000000,,,,,0.3500000
SGSYSRSPVR,ph,S,152,true,"Phospho cell culture sucrose/TOR",109,30833711,,,0.9592070,,,,,
SGSYSRSPVR,ph,S,152,true,"Tissue atlas Arabidopsis - ProteomicsDB",114,32188942,"MaxQuant score",111.3100000,0.9628490,,,,5.4834599723108E-5,
ERSVEERSR,ph,S,188,true,"atm and atr DNA damage response",88,25561503,"MASCOT Score",25.0000000,1.0000000,,,,,0.1100000
ERSVEERSR,ph,S,188,true,"Tissue atlas Arabidopsis - ProteomicsDB",114,32188942,"MaxQuant score",157.9700000,1.0000000,,,,0.0036166200879961,
ERSVEERSR,ph,S,193,true,"atm and atr DNA damage response",88,25561503,"MASCOT Score",25.0000000,1.0000000,,,,,0.1100000
ERSVEERSR,ph,S,193,true,"Tissue atlas Arabidopsis - ProteomicsDB",114,32188942,"MaxQuant score",76.8680000,1.0000000,,,,0.0036166200879961,
RMDDSLSPRAR,ph,S,202,true,"Brassinosteroid-Regulated Phosphorylation Dynamics",94,26187819,"MaxQuant Score",136.6000000,1.0000000,,,,0.0049999998882413,0.7530000
RMDDSLSPR,ph,S,202,true,"STN8 phosphoproteome",38,21768351,"MASCOT Score",39.8000000,,,,,,
RMDDSLSPR,ph,S,202,true,"Phosphoproteome ethylene-regulated time response",46,24043427,"MASCOT Score",43.2600000,,,,,,13.0334000
RMDDSLSPR,ph,S,202,true,"Chloroplast kinase substrates",60,19376835,"MASCOT Score",33.2500000,,,,,,-0.6977080
RMDDSLSPR,ph,S,202,true,"srk2dei ABA signaling phopshoproteomics",83,23572148,"MASCOT Score",54.0000000,,,,,,-0.0005000
RMDDSLSPR,ph,S,202,true,"LAXIC - mannitol vs control",84b,23660473,XCorr,2.8600000,1.0000000,,,,1.330000031885E-5,
RMDDSLSPR,ph,S,202,true,"SnRK2 protein kinase substrates",85,23776212,XCorr,2.2099874,1.0000000,,,,6.6719798041959E-7,
RMDDSLSPR,ph,S,202,true,"SIRK1 phosphorylation",86a,23820729,"MaxQuant Score",122.3100000,1.0000000,,,,0.023000000044703,7.9560000
RMDDSLSPR,ph,S,202,true,"atm and atr DNA damage response",88,25561503,"MASCOT Score",50.0000000,1.0000000,,,,,-0.8200000
RMDDSLSPR,ph,S,202,true,"TOR Kinase and ABA Receptor",100,29290610,XCorr,3.0844500,1.0000000,,,,9.8930002423003E-5,
RMDDSLSPR,ph,S,202,true,"Phospho cell culture sucrose/TOR",109,30833711,,,1.0000000,,,,,
RMDDSLSPR,ph,S,202,true,"Col-0 callus - FC Col-0 vs. Col-0 Xray",111a,31410901,,28.8200000,,-0.1353219,0.0000000,NO,,-0.0919234
RMDDSLSPR,ph,S,202,true,"Col-0 X-ray callus - FC Col-0 vs. Col-0 Xray",111b,31410901,,28.8200000,,-0.1353219,0.0000000,NO,,-0.0919234
RMDDSLSPR,ph,S,202,true,"atm callus - FC atm vs. atm Xray",111c,31410901,,28.8200000,,-1.6259204,0.0000000,NO,,-0.0919234
RMDDSLSPR,ph,S,202,true,"atm-3 X-ray callus - FC atm vs. atm Xray",111d,31410901,,28.8200000,,-1.6259204,0.0000000,NO,,-0.0919234
RMDDSLSPR,ph,S,202,true,"Tissue atlas Arabidopsis - ProteomicsDB",114,32188942,"MaxQuant score",133.4200000,1.0000000,,,,0.00023877300554886,
MDDSLSPR,ph,S,202,true,"Phosphorylation RNA metabolism",22,16807317,,,,,,,,
MDDSLSPR,ph,S,202,true,"Chloroplast kinase substrates",60,19376835,"MASCOT Score",30.3000000,,,,,,-0.2167490
MDDSLSPR,ph,S,202,true,"LAXIC - mannitol vs control",84b,23660473,XCorr,3.2800000,1.0000000,,,,6.289999873843E-5,
MDDSLSPR,ph,S,202,true,"SnRK2 protein kinase substrates",85,23776212,XCorr,2.5924952,1.0000000,,,,0.00043027300853282,
MDDSLSPR,ph,S,202,true,"atm and atr DNA damage response",88,25561503,"MASCOT Score",43.0000000,1.0000000,,,,,0.1300000
MDDSLSPR,ph,S,202,true,"Lateral root-induction - NAA vs control",106,23328941,"MASCOT Score",24.0000000,,,,,,
RMDDSLSPRAR,ph,S,204,true,"Brassinosteroid-Regulated Phosphorylation Dynamics",94,26187819,"MaxQuant Score",136.6000000,1.0000000,,,,0.0049999998882413,0.7530000
RMDDSLSPR,ph,S,204,true,"Phosphoproteome ethylene-regulated time response",46,24043427,"MASCOT Score",43.2600000,,,,,,13.0334000
RMDDSLSPR,ph,S,204,true,"Tyrosine phosphorylation in Arabidopsis",59,18463617,"MASCOT Score",32.0000000,,,,,,-1.2116250
RMDDSLSPR,ph,S,204,true,"Chloroplast kinase substrates",60,19376835,"MASCOT Score",33.2500000,,,,,,-0.6977080
RMDDSLSPR,ph,S,204,true,"srk2dei ABA signaling phopshoproteomics",83,23572148,"MASCOT Score",54.0000000,,,,,,-0.0005000
RMDDSLSPR,ph,S,204,true,"LAXIC - mannitol vs control",84b,23660473,XCorr,2.8600000,1.0000000,,,,1.330000031885E-5,
RMDDSLSPR,ph,S,204,true,"SnRK2 protein kinase substrates",85,23776212,XCorr,2.2099874,1.0000000,,,,6.6719798041959E-7,
RMDDSLSPR,ph,S,204,true,"SIRK1 phosphorylation",86a,23820729,"MaxQuant Score",122.3100000,1.0000000,,,,0.023000000044703,7.9560000
RMDDSLSPR,ph,S,204,true,"atm and atr DNA damage response",88,25561503,"MASCOT Score",56.0000000,1.0000000,,,,,0.0400000
RMDDSLSPR,ph,S,204,true,"TOR Kinase and ABA Receptor",100,29290610,XCorr,3.0844500,1.0000000,,,,9.8930002423003E-5,
RMDDSLSPR,ph,S,204,true,"Col-0 callus - FC Col-0 vs. Col-0 Xray",111a,31410901,,28.8200000,,-0.1353219,0.0000000,NO,,-0.0919234
RMDDSLSPR,ph,S,204,true,"Col-0 X-ray callus - FC Col-0 vs. Col-0 Xray",111b,31410901,,28.8200000,,-0.1353219,0.0000000,NO,,-0.0919234
RMDDSLSPR,ph,S,204,true,"atm callus - FC atm vs. atm Xray",111c,31410901,,28.8200000,,-1.6259204,0.0000000,NO,,-0.0919234
RMDDSLSPR,ph,S,204,true,"atm-3 X-ray callus - FC atm vs. atm Xray",111d,31410901,,28.8200000,,-1.6259204,0.0000000,NO,,-0.0919234
RMDDSLSPR,ph,S,204,true,"Tissue atlas Arabidopsis - ProteomicsDB",114,32188942,"MaxQuant score",139.1500000,1.0000000,,,,0.00019477099704091,
MDDSLSPR,ph,S,204,true,"Phosphorylation RNA metabolism",22,16807317,,,,,,,,
MDDSLSPR,ph,S,204,true,"Large-scale phosphorylation discovery",44,23111157,XCorr,3.3100000,,,,,,
MDDSLSPR,ph,S,204,true,"Tyrosine phosphorylation in Arabidopsis",59,18463617,"MASCOT Score",41.0000000,,,,,,-0.9005653
MDDSLSPR,ph,S,204,true,"Chloroplast kinase substrates",60,19376835,"MASCOT Score",30.3000000,,,,,,-0.2167490
MDDSLSPR,ph,S,204,true,"LAXIC - mannitol vs control",84b,23660473,XCorr,3.2800000,1.0000000,,,,6.289999873843E-5,
MDDSLSPR,ph,S,204,true,"SnRK2 protein kinase substrates",85,23776212,XCorr,2.5924952,1.0000000,,,,0.00043027300853282,
MDDSLSPR,ph,S,204,true,"atm and atr DNA damage response",88,25561503,"MASCOT Score",43.0000000,1.0000000,,,,,0.1300000
MDDSLSPR,ph,S,204,true,"Lateral root-induction - NAA vs control",106,23328941,"MASCOT Score",24.0000000,,,,,,
DRSPVLDDEGSPKIIDGSPPPSPK,ph,S,211,true,"Arabidopsis root NAA phosphoproteome",18a,27643528,"MaxQuant Score",102.0700000,1.0000000,,,,1.1730000304411E-9,0.0860000
DRSPVLDDEGSPKIIDGSPPPSPK,ph,S,211,true,"Chloroplast kinase substrates",60,19376835,"MASCOT Score",37.2900000,,,,,,-1.0052300
DRSPVLDDEGSPKIIDGSPPPSPK,ph,S,211,true,"srk2dei ABA signaling phopshoproteomics",83,23572148,"MASCOT Score",47.0000000,,,,,,-0.0005000
DRSPVLDDEGSPKIIDGSPPPSPK,ph,S,211,true,"SnRK2 protein kinase substrates",85,23776212,XCorr,3.4780734,1.0000000,,,,2.8156998954643E-10,
DRSPVLDDEGSPKIIDGSPPPSPK,ph,S,211,true,"Phospho cell culture sucrose/TOR",109,30833711,,,1.0000000,,,,,
ARDRSPVLDDEGSPK,ph,S,211,true,"STN8 phosphoproteome",38,21768351,"MASCOT Score",57.8800000,,,,,,
ARDRSPVLDDEGSPK,ph,S,211,true,"Chloroplast kinase substrates",60,19376835,"MASCOT Score",58.2500000,,,,,,-0.3919100
ARDRSPVLDDEGSPK,ph,S,211,true,"srk2dei ABA signaling phopshoproteomics",83,23572148,"MASCOT Score",82.0000000,,,,,,-0.0006000
ARDRSPVLDDEGSPK,ph,S,211,true,"LAXIC - mannitol vs control",84b,23660473,XCorr,3.3500000,1.0000000,,,,0.00032301098690368,
ARDRSPVLDDEGSPK,ph,S,211,true,"SnRK2 protein kinase substrates",85,23776212,XCorr,4.0712681,1.0000000,,,,2.1025799412655E-7,
ARDRSPVLDDEGSPK,ph,S,211,true,"TOR Kinase and ABA Receptor",100,29290610,XCorr,4.5784841,1.0000000,,,,0.00091100001009181,
DRSPVLDDEGSPK,ph,S,211,true,"Phosphorylation RNA metabolism",22,16807317,,,,,,,,
DRSPVLDDEGSPK,ph,S,211,true,"Ethylene-regulated phosphorylation ein2 mutant",30,19253305,"MASCOT Score",40.0000000,,,,,,8.2228030
DRSPVLDDEGSPK,ph,S,211,true,"STN8 phosphoproteome",38,21768351,"MASCOT Score",78.2600000,,,,,,
DRSPVLDDEGSPK,ph,S,211,true,"Phosphoproteome iron-deficient Arabidopsis roots",41,22438062,"MASCOT Score",37.3700000,,,,,,
DRSPVLDDEGSPK,ph,S,211,true,"Pollen phosphoproteome Arabidopsis",43,22631563,"MASCOT Score",57.2500000,,,,,,-1.9537600
DRSPVLDDEGSPK,ph,S,211,true,"Phosphoproteome ethylene-regulated time response",46,24043427,"MASCOT Score",60.6300000,,,,,,2.9566000
DRSPVLDDEGSPK,ph,S,211,true,"Tyrosine phosphorylation in Arabidopsis",59,18463617,"MASCOT Score",47.0000000,,,,,,-0.4686540
DRSPVLDDEGSPK,ph,S,211,true,"Chloroplast kinase substrates",60,19376835,"MASCOT Score",83.7400000,,,,,,-1.0652200
DRSPVLDDEGSPK,ph,S,211,true,"srk2dei ABA signaling phopshoproteomics",83,23572148,"MASCOT Score",68.0000000,,,,,,-0.0003000
DRSPVLDDEGSPK,ph,S,211,true,"LAXIC - ABA stress",84a,23660473,XCorr,2.7200000,1.0000000,,,,0.12844899296761,
DRSPVLDDEGSPK,ph,S,211,true,"LAXIC - mannitol vs control",84b,23660473,XCorr,4.9000000,1.0000000,,,,4.7200000852232E-11,
DRSPVLDDEGSPK,ph,S,211,true,"SnRK2 protein kinase substrates",85,23776212,XCorr,4.4979367,1.0000000,,,,0.0020260300952941,
DRSPVLDDEGSPK,ph,S,211,true,"SIRK1 phosphorylation",86a,23820729,"MaxQuant Score",182.5800000,1.0000000,,,,7.6700001955032E-5,9.1840000
DRSPVLDDEGSPK,ph,S,211,true,"SIRK1 exp - sirk1 mutant vs WT",86b,23820729,,,,-0.0636127,,NO,,
DRSPVLDDEGSPK,ph,S,211,true,"SIRK1 exp - 35S:SIRK1 vs WT",86c,23820729,,,,0.6040868,,NO,,
DRSPVLDDEGSPK,ph,S,211,true,"atm and atr DNA damage response",88,25561503,"MASCOT Score",72.0000000,1.0000000,,,,,0.2100000
DRSPVLDDEGSPK,ph,S,211,true,"Brassinosteroid-Regulated Phosphorylation Dynamics",94,26187819,"MaxQuant Score",162.3200000,1.0000000,,,,5.4909880324568E-41,0.5950000
DRSPVLDDEGSPK,ph,S,211,true,"TOR Kinase and ABA Receptor",100,29290610,XCorr,5.2673974,1.0000000,,,,1.5340000345532E-6,
DRSPVLDDEGSPK,ph,S,211,true,"Col-0 callus - FC Col-0 vs. Col-0 Xray",111a,31410901,,65.1100000,,0.0376241,0.0000000,NO,,0.8027349
DRSPVLDDEGSPK,ph,S,211,true,"Col-0 X-ray callus - FC Col-0 vs. Col-0 Xray",111b,31410901,,65.1100000,,0.0376241,0.0000000,NO,,0.8027349
DRSPVLDDEGSPK,ph,S,211,true,"atm callus - FC atm vs. atm Xray",111c,31410901,,65.1100000,,-1.0017929,0.0000000,NO,,0.8027349
DRSPVLDDEGSPK,ph,S,211,true,"atm-3 X-ray callus - FC atm vs. atm Xray",111d,31410901,,65.1100000,,-1.0017929,0.0000000,NO,,0.8027349
SPVLDDEGSPK,ph,S,211,true,"STN8 phosphoproteome",38,21768351,"MASCOT Score",55.9300000,,,,,,
SPVLDDEGSPK,ph,S,211,true,"Chloroplast kinase substrates",60,19376835,"MASCOT Score",30.1500000,,,,,,0.0824977
SPVLDDEGSPK,ph,S,211,true,"LAXIC - mannitol vs control",84b,23660473,XCorr,2.4500000,1.0000000,,,,0.028568800538778,
SPVLDDEGSPK,ph,S,211,true,"atm and atr DNA damage response",88,25561503,"MASCOT Score",58.0000000,1.0000000,,,,,-0.8700000
SPVLDDEGSPK,ph,S,211,true,"Tissue atlas Arabidopsis - ProteomicsDB",114,32188942,"MaxQuant score",262.3700000,1.0000000,,,,0,
DRSPVLDDEGSPKIIDGSPPPSPK,ph,S,219,true,"Arabidopsis root NAA phosphoproteome",18a,27643528,"MaxQuant Score",102.0700000,1.0000000,,,,1.1730000304411E-9,0.0860000
DRSPVLDDEGSPKIIDGSPPPSPK,ph,S,219,true,"Chloroplast kinase substrates",60,19376835,"MASCOT Score",37.2900000,,,,,,-1.0052300
DRSPVLDDEGSPKIIDGSPPPSPK,ph,S,219,true,"srk2dei ABA signaling phopshoproteomics",83,23572148,"MASCOT Score",47.0000000,,,,,,-0.0005000
DRSPVLDDEGSPKIIDGSPPPSPK,ph,S,219,true,"SnRK2 protein kinase substrates",85,23776212,XCorr,3.4780734,1.0000000,,,,2.8156998954643E-10,
ARDRSPVLDDEGSPK,ph,S,219,true,"Chloroplast kinase substrates",60,19376835,"MASCOT Score",58.2500000,,,,,,-0.3919100
ARDRSPVLDDEGSPK,ph,S,219,true,"srk2dei ABA signaling phopshoproteomics",83,23572148,"MASCOT Score",82.0000000,,,,,,-0.0006000
ARDRSPVLDDEGSPK,ph,S,219,true,"LAXIC - mannitol vs control",84b,23660473,XCorr,3.3500000,1.0000000,,,,0.00032301098690368,
ARDRSPVLDDEGSPK,ph,S,219,true,"SnRK2 protein kinase substrates",85,23776212,XCorr,4.0712681,1.0000000,,,,2.1025799412655E-7,
ARDRSPVLDDEGSPK,ph,S,219,true,"TOR Kinase and ABA Receptor",100,29290610,XCorr,4.5784841,1.0000000,,,,0.00091100001009181,
DRSPVLDDEGSPK,ph,S,219,true,"Phosphorylation RNA metabolism",22,16807317,,,,,,,,
DRSPVLDDEGSPK,ph,S,219,true,"Ethylene-regulated phosphorylation ein2 mutant",30,19253305,"MASCOT Score",40.0000000,,,,,,8.2228030
DRSPVLDDEGSPK,ph,S,219,true,"Immuno-dot blot phosphorylation",31,19341826,"MASCOT Score",57.3300000,,,,,,
DRSPVLDDEGSPK,ph,S,219,true,"STN8 phosphoproteome",38,21768351,"MASCOT Score",72.4600000,,,,,,-1.9184800
DRSPVLDDEGSPK,ph,S,219,true,"Phosphoproteome iron-deficient Arabidopsis roots",41,22438062,"MASCOT Score",37.3700000,,,,,,
DRSPVLDDEGSPK,ph,S,219,true,"Pollen phosphoproteome Arabidopsis",43,22631563,"MASCOT Score",57.2500000,,,,,,-1.9537600
DRSPVLDDEGSPK,ph,S,219,true,"Phosphoproteome ethylene-regulated time response",46,24043427,"MASCOT Score",60.6300000,,,,,,2.9566000
DRSPVLDDEGSPK,ph,S,219,true,"Tyrosine phosphorylation in Arabidopsis",59,18463617,"MASCOT Score",82.0000000,,,,,,-0.6695059
DRSPVLDDEGSPK,ph,S,219,true,"Chloroplast kinase substrates",60,19376835,"MASCOT Score",83.7400000,,,,,,-1.0652200
DRSPVLDDEGSPK,ph,S,219,true,"srk2dei ABA signaling phopshoproteomics",83,23572148,"MASCOT Score",82.0000000,,,,,,-0.0020000
DRSPVLDDEGSPK,ph,S,219,true,"LAXIC - ABA stress",84a,23660473,XCorr,2.3700000,1.0000000,,,,0.11975499987602,
DRSPVLDDEGSPK,ph,S,219,true,"LAXIC - mannitol vs control",84b,23660473,XCorr,4.9000000,1.0000000,,,,4.7200000852232E-11,
DRSPVLDDEGSPK,ph,S,219,true,"SnRK2 protein kinase substrates",85,23776212,XCorr,4.4979367,1.0000000,,,,0.0020260300952941,
DRSPVLDDEGSPK,ph,S,219,true,"SIRK1 phosphorylation",86a,23820729,"MaxQuant Score",182.5800000,1.0000000,,,,7.6700001955032E-5,9.1840000
DRSPVLDDEGSPK,ph,S,219,true,"atm and atr DNA damage response",88,25561503,"MASCOT Score",50.0000000,1.0000000,,,,,-0.6600000
DRSPVLDDEGSPK,ph,S,219,true,"Brassinosteroid-Regulated Phosphorylation Dynamics",94,26187819,"MaxQuant Score",162.3200000,1.0000000,,,,5.4909880324568E-41,0.5950000
DRSPVLDDEGSPK,ph,S,219,true,"TOR Kinase and ABA Receptor",100,29290610,XCorr,5.2673974,1.0000000,,,,1.5340000345532E-6,
DRSPVLDDEGSPK,ph,S,219,true,"Col-0 callus - FC Col-0 vs. Col-0 Xray",111a,31410901,,68.6600000,,-0.5587672,0.0000000,NO,,0.6537141
DRSPVLDDEGSPK,ph,S,219,true,"Col-0 X-ray callus - FC Col-0 vs. Col-0 Xray",111b,31410901,,68.6600000,,-0.5587672,0.0000000,NO,,0.6537141
DRSPVLDDEGSPK,ph,S,219,true,"atm callus - FC atm vs. atm Xray",111c,31410901,,68.6600000,,0.5262680,0.0000000,NO,,0.6537141
DRSPVLDDEGSPK,ph,S,219,true,"atm-3 X-ray callus - FC atm vs. atm Xray",111d,31410901,,68.6600000,,0.5262680,0.0000000,NO,,0.6537141
SPVLDDEGSPK,ph,S,219,true,"Phosphorylation RNA metabolism",22,16807317,,,,,,,,
SPVLDDEGSPK,ph,S,219,true,"Tyrosine phosphorylation in Arabidopsis",59,18463617,"MASCOT Score",45.0000000,,,,,,-0.4089942
SPVLDDEGSPK,ph,S,219,true,"Chloroplast kinase substrates",60,19376835,"MASCOT Score",30.1500000,,,,,,0.0824977
SPVLDDEGSPK,ph,S,219,true,"LAXIC - mannitol vs control",84b,23660473,XCorr,2.7600000,1.0000000,,,,0.0022098599001765,
SPVLDDEGSPK,ph,S,219,true,"SnRK2 protein kinase substrates",85,23776212,XCorr,2.7533863,1.0000000,,,,0.030086599290371,
SPVLDDEGSPK,ph,S,219,true,"atm and atr DNA damage response",88,25561503,"MASCOT Score",58.0000000,1.0000000,,,,,-0.8700000
SPVLDDEGSPK,ph,S,219,true,"Phospho cell culture sucrose/TOR",109,30833711,,,1.0000000,,,,,
SPVLDDEGSPK,ph,S,219,true,"Tissue atlas Arabidopsis - ProteomicsDB",114,32188942,"MaxQuant score",262.3700000,1.0000000,,,,0,
DRSPVLDDEGSPKIIDGSPPPSPK,ph,S,226,true,"Arabidopsis root NAA phosphoproteome",18a,27643528,"MaxQuant Score",102.0700000,1.0000000,,,,1.1730000304411E-9,0.0860000
DRSPVLDDEGSPKIIDGSPPPSPK,ph,S,226,true,"Chloroplast kinase substrates",60,19376835,"MASCOT Score",37.2900000,,,,,,-1.0052300
DRSPVLDDEGSPKIIDGSPPPSPK,ph,S,226,true,"srk2dei ABA signaling phopshoproteomics",83,23572148,"MASCOT Score",47.0000000,,,,,,-0.0005000
DRSPVLDDEGSPKIIDGSPPPSPK,ph,S,226,true,"SnRK2 protein kinase substrates",85,23776212,XCorr,3.4780734,1.0000000,,,,2.8156998954643E-10,
IIDGSPPPSPKLQK,ph,S,226,true,"STN8 phosphoproteome",38,21768351,"MASCOT Score",51.8200000,,,,,,
IIDGSPPPSPKLQK,ph,S,226,true,"Chloroplast kinase substrates",60,19376835,"MASCOT Score",35.3800000,,,,,,0.2569500
IIDGSPPPSPK,ph,S,226,true,"Arabidopsis root NAA phosphoproteome",18a,27643528,"MaxQuant Score",51.5910000,1.0000000,,,,0.00033569999504834,-0.2910000
IIDGSPPPSPK,ph,S,226,true,"Phosphorylation RNA metabolism",22,16807317,,,,,,,,
IIDGSPPPSPK,ph,S,226,true,"Immuno-dot blot phosphorylation",31,19341826,"MASCOT Score",41.8800000,,,,,,3.4296100
IIDGSPPPSPK,ph,S,226,true,"STN8 phosphoproteome",38,21768351,"MASCOT Score",56.6400000,,,,,,
IIDGSPPPSPK,ph,S,226,true,"Pollen phosphoproteome Arabidopsis",43,22631563,"MASCOT Score",39.7800000,,,,,,-2.0577800
IIDGSPPPSPK,ph,S,226,true,"Phosphoproteome ethylene-regulated time response",46,24043427,"MASCOT Score",50.6700000,,,,,,6.3221000
IIDGSPPPSPK,ph,S,226,true,"Chloroplast kinase substrates",60,19376835,"MASCOT Score",57.2500000,,,,,,-0.5127000
IIDGSPPPSPK,ph,S,226,true,"srk2dei ABA signaling phopshoproteomics",83,23572148,"MASCOT Score",42.0000000,,,,,,-0.0002000
IIDGSPPPSPK,ph,S,226,true,"LAXIC - ABA stress",84a,23660473,XCorr,3.3800000,1.0000000,,,,0.019188499078155,
IIDGSPPPSPK,ph,S,226,true,"LAXIC - mannitol vs control",84b,23660473,XCorr,3.2000000,1.0000000,,,,2.900000072259E-5,
IIDGSPPPSPK,ph,S,226,true,"SnRK2 protein kinase substrates",85,23776212,XCorr,2.9742026,1.0000000,,,,0.0071282000280917,
IIDGSPPPSPK,ph,S,226,true,"SIRK1 phosphorylation",86a,23820729,"MaxQuant Score",187.3200000,1.0000000,,,,2.9600000743812E-6,9.2420000
IIDGSPPPSPK,ph,S,226,true,"atm and atr DNA damage response",88,25561503,"MASCOT Score",58.0000000,1.0000000,,,,,0.9200000
IIDGSPPPSPK,ph,S,226,true,"Brassinosteroid-Regulated Phosphorylation Dynamics",94,26187819,"MaxQuant Score",92.7730000,1.0000000,,,,0.016000000759959,1.4950000
IIDGSPPPSPK,ph,S,226,true,"TOR Kinase and ABA Receptor",100,29290610,XCorr,3.5581417,1.0000000,,,,8.0869998782873E-5,
IIDGSPPPSPK,ph,S,226,true,"Lateral root-induction - NAA vs control",106,23328941,"MASCOT Score",45.0000000,,,,,,
IIDGSPPPSPK,ph,S,226,true,"Phospho cell culture sucrose/TOR",109,30833711,,,1.0000000,,,,,
IIDGSPPPSPK,ph,S,226,true,"Col-0 callus - FC Col-0 vs. Col-0 Xray",111a,31410901,,61.8300000,,-0.1853185,0.0000000,NO,,0.0187571
IIDGSPPPSPK,ph,S,226,true,"Col-0 X-ray callus - FC Col-0 vs. Col-0 Xray",111b,31410901,,61.8300000,,-0.1853185,0.0000000,NO,,0.0187571
IIDGSPPPSPK,ph,S,226,true,"atm callus - FC atm vs. atm Xray",111c,31410901,,61.8300000,,-0.6823848,0.0000000,NO,,0.0187571
IIDGSPPPSPK,ph,S,226,true,"atm-3 X-ray callus - FC atm vs. atm Xray",111d,31410901,,61.8300000,,-0.6823848,0.0000000,NO,,0.0187571
IIDGSPPPSPK,ph,S,226,true,"Tissue atlas Arabidopsis - ProteomicsDB",114,32188942,"MaxQuant score",164.9200000,1.0000000,,,,3.1381799936447E-11,
DRSPVLDDEGSPKIIDGSPPPSPK,ph,S,230,true,"Arabidopsis root NAA phosphoproteome",18a,27643528,"MaxQuant Score",102.0700000,1.0000000,,,,1.1730000304411E-9,0.0860000
DRSPVLDDEGSPKIIDGSPPPSPK,ph,S,230,true,"Chloroplast kinase substrates",60,19376835,"MASCOT Score",37.2900000,,,,,,-1.0052300
DRSPVLDDEGSPKIIDGSPPPSPK,ph,S,230,true,"srk2dei ABA signaling phopshoproteomics",83,23572148,"MASCOT Score",47.0000000,,,,,,-0.0005000
DRSPVLDDEGSPKIIDGSPPPSPK,ph,S,230,true,"SnRK2 protein kinase substrates",85,23776212,XCorr,3.4780734,1.0000000,,,,2.8156998954643E-10,
IIDGSPPPSPKLQK,ph,S,230,true,"Chloroplast kinase substrates",60,19376835,"MASCOT Score",35.3800000,,,,,,0.2569500
IIDGSPPPSPK,ph,S,230,true,"Arabidopsis root NAA phosphoproteome",18a,27643528,"MaxQuant Score",51.5910000,1.0000000,,,,0.00033569999504834,-0.2910000
IIDGSPPPSPK,ph,S,230,true,"Phosphorylation RNA metabolism",22,16807317,,,,,,,,
IIDGSPPPSPK,ph,S,230,true,"Immuno-dot blot phosphorylation",31,19341826,"MASCOT Score",41.8800000,,,,,,3.4296100
IIDGSPPPSPK,ph,S,230,true,"Pollen phosphoproteome Arabidopsis",43,22631563,"MASCOT Score",39.7800000,,,,,,-2.0577800
IIDGSPPPSPK,ph,S,230,true,"Phosphoproteome ethylene-regulated time response",46,24043427,"MASCOT Score",50.6700000,,,,,,6.3221000
IIDGSPPPSPK,ph,S,230,true,"Chloroplast kinase substrates",60,19376835,"MASCOT Score",57.2500000,,,,,,-0.5127000
IIDGSPPPSPK,ph,S,230,true,"srk2dei ABA signaling phopshoproteomics",83,23572148,"MASCOT Score",42.0000000,,,,,,-0.0002000
IIDGSPPPSPK,ph,S,230,true,"LAXIC - ABA stress",84a,23660473,XCorr,3.3800000,1.0000000,,,,0.019188499078155,
IIDGSPPPSPK,ph,S,230,true,"LAXIC - mannitol vs control",84b,23660473,XCorr,3.2000000,1.0000000,,,,2.900000072259E-5,
IIDGSPPPSPK,ph,S,230,true,"SnRK2 protein kinase substrates",85,23776212,XCorr,2.9255326,1.0000000,,,,0.0007834269781597,
IIDGSPPPSPK,ph,S,230,true,"SIRK1 phosphorylation",86a,23820729,"MaxQuant Score",187.3200000,1.0000000,,,,2.9600000743812E-6,9.2420000
IIDGSPPPSPK,ph,S,230,true,"atm and atr DNA damage response",88,25561503,"MASCOT Score",58.0000000,1.0000000,,,,,0.9200000
IIDGSPPPSPK,ph,S,230,true,"Brassinosteroid-Regulated Phosphorylation Dynamics",94,26187819,"MaxQuant Score",92.7730000,1.0000000,,,,0.016000000759959,1.4950000
IIDGSPPPSPK,ph,S,230,true,"TOR Kinase and ABA Receptor",100,29290610,XCorr,3.5581417,1.0000000,,,,8.0869998782873E-5,
IIDGSPPPSPK,ph,S,230,true,"Lateral root-induction - NAA vs control",106,23328941,"MASCOT Score",45.0000000,,,,,,
IIDGSPPPSPK,ph,S,230,true,"Col-0 callus - FC Col-0 vs. Col-0 Xray",111a,31410901,,61.8300000,,-0.1853185,0.0000000,NO,,0.0187571
IIDGSPPPSPK,ph,S,230,true,"Col-0 X-ray callus - FC Col-0 vs. Col-0 Xray",111b,31410901,,61.8300000,,-0.1853185,0.0000000,NO,,0.0187571
IIDGSPPPSPK,ph,S,230,true,"atm callus - FC atm vs. atm Xray",111c,31410901,,61.8300000,,-0.6823848,0.0000000,NO,,0.0187571
IIDGSPPPSPK,ph,S,230,true,"atm-3 X-ray callus - FC atm vs. atm Xray",111d,31410901,,61.8300000,,-0.6823848,0.0000000,NO,,0.0187571
IIDGSPPPSPK,ph,S,230,true,"Tissue atlas Arabidopsis - ProteomicsDB",114,32188942,"MaxQuant score",179.6700000,1.0000000,,,,5.4129501580883E-14,
EVGSDRDGGSPQDNGRNSVVSPVVGAGGDSSK,ph,S,239,true,"Brassinosteroid-Regulated Phosphorylation Dynamics",94,26187819,"MaxQuant Score",62.3770000,0.9970000,,,,0.0099999997764826,-0.9720000
LQKEVGSDRDGGSPQDNGR,ph,S,239,true,"Chloroplast kinase substrates",60,19376835,"MASCOT Score",34.9000000,,,,,,-1.1943200
EVGSDRDGGSPQDNGR,ph,S,239,true,"LAXIC - mannitol vs control",84b,23660473,XCorr,2.1800000,1.0000000,,,,0.00091379997320473,
EVGSDRDGGSPQDNGR,ph,S,239,true,"SnRK2 protein kinase substrates",85,23776212,XCorr,2.4198122,1.0000000,,,,0.024901799857616,