Peptide,PTM,ModifiedAA,ModifiedPosition,PeptideUniqueToGene,ExperimentDesc,ExpID,PubmedID,ScoreType,IdentScore,LocProb,Log2FChange,PQ-val,QuantSig,PEP,MassErrorPPM
AASASSLALS,nt,A,2,true,"N-term acetylation drought responses",5,26184543,,,,,,,,
AASASSLALS,nta,A,2,true,"N-term acetylation drought responses",5,26184543,,,,,,,,
PASVSLLSPSLSFK,ph,S,36,true,"Tissue atlas Arabidopsis - ProteomicsDB",114,32188942,"MaxQuant score",246.7500000,0.9948240,,,,0,
LNSDSVSFSIAAKWNSPASR,ub,K,51,true,"Protein ubiquitination during photomorphogenesis",3,28461270,,,,,,,,
VAITSEFEVEED,nt,V,63,true,"HUNTER N-terminome: legumain, GluC and trypsin",119,31951383,"MaxQuant score",99.1360000,,,,,,
VAITSEFE,nt,V,63,true,"N-terminal ChaFRADIC",92,26010716,"MASCOT Score",44.4900000,,,,,0.006810000166297,
VAITSEFE,nt,V,63,true,"Arg/N-end rule seed, prt6 vs. Wt",99,29168982,"MASCOT Score",48.8000000,,0.0822094,0.8916280,NO,0.0044129998423159,-0.6761745
VAITSEFEVEEDGFADVAPPKEQSFSADLK,nta,V,63,true,"Characterization plant N-terminal acetylation",6,22223895,"MASCOT Score",87.8200000,,,,,,
VAITSEFE,nta,V,63,true,"HUNTER N-terminome: legumain, GluC and trypsin",119,31951383,"MaxQuant score",139.9200000,,,,,,
EFEVEEDGFADVAPPKEQSFSAD,nt,E,68,true,"HUNTER N-terminome: legumain, GluC and trypsin",119,31951383,"MaxQuant score",107.4500000,,,,,,
EFEVEEDGFAD,nt,E,68,true,"HUNTER N-terminome: legumain, GluC and trypsin",119,31951383,"MaxQuant score",103.5600000,,,,,,
EQSFSADLK,ph,S,86,true,"atm and atr DNA damage response",88,25561503,"MASCOT Score",40.0000000,0.9970000,,,,,-1.3000000
EQSFSADLK,ph,S,88,true,"atm and atr DNA damage response",88,25561503,"MASCOT Score",28.0000000,0.9970000,,,,,-0.5100000
SAQLAQLFE,nt,S,104,false,"Arg/N-end rule seed, prt6 vs. Wt",99,29168982,"MASCOT Score",28.5900000,,,,,0.035719998180866,0.2250161
VNAGPPPPKR,ac,K,172,false,"Quantitative Acetylproteomics",101,29440448,,,,,,,,
SSFGSSGSGYGGGGGSGAGSGNR,nt,S,183,true,"N-terminal ChaFRADIC",92,26010716,"MASCOT Score",112.9300000,,,,,1.1490000235439E-14,
SSFGSSGSGYGGGGGSGAGSGNR,ph,S,183,true,"Tyrosine phosphorylation in Arabidopsis",59,18463617,"MASCOT Score",66.0000000,,,,,,-2.3165104
SSFGSSGSGYGGGGGSGAGSGNR,ph,S,183,true,"SnRK2 protein kinase substrates",85,23776212,XCorr,3.6350482,0.9070000,,,,8.9768196630757E-5,
SSFGSSGSGYGGGGGSGAGSGNR,ph,S,183,true,"atm and atr DNA damage response",88,25561503,"MASCOT Score",70.0000000,0.9900000,,,,,-0.2800000
SSFGSSGSGYGGGGGSGAGSGNR,ph,S,183,true,"Lateral root-induction - NAA vs control",106,23328941,"MASCOT Score",49.0000000,,,,,,
SFGSSGSGYGGGGGSGAGSGNR,nt,S,184,true,"Tic56 chloroplast import - tic56-1",89c,25588737,XCorr,4.6157312,,,,,,
SSGSGYGGGGGSGAGSGNR,nt,S,187,true,"Tic56 chloroplast import - wild-type",89a,25588737,XCorr,4.7798553,,,,,,
SSGSGYGGGGGSGAGSGNR,nt,S,187,true,"Tic56 chloroplast import - ppi2",89b,25588737,XCorr,4.5895772,,,,,,
SSGSGYGGGGGSGAGSGNR,nt,S,187,true,"Tic56 chloroplast import - tic56-1",89c,25588737,XCorr,4.2464809,,,,,,
SSGSGYGGGGGSGAGSGNR,nt,S,187,true,"N-terminal ChaFRADIC",92,26010716,"MASCOT Score",101.3500000,,,,,1.3220000549822E-16,
SSGSGYGGGGGSGAGSGNR,nt,S,187,true,"Arg/N-end rule seed, prt6 vs. Wt",99,29168982,"MASCOT Score",78.0900000,,0.0637849,0.9584610,NO,0.00085910002235323,-0.6769759
SSFGSSGSGYGGGGGSGAGSGNR,ph,S,187,true,"Tyrosine phosphorylation in Arabidopsis",59,18463617,"MASCOT Score",73.0000000,,,,,,-0.9568183
SSFGSSGSGYGGGGGSGAGSGNR,ph,S,187,true,"LAXIC - mannitol vs control",84b,23660473,XCorr,4.6400000,0.8350000,,,,2.8600001056658E-13,
SSFGSSGSGYGGGGGSGAGSGNR,ph,S,187,true,"atm and atr DNA damage response",88,25561503,"MASCOT Score",50.0000000,0.9890000,,,,,-0.1100000
SSFGSSGSGYGGGGGSGAGSGNR,ph,S,187,true,"TOR Kinase and ABA Receptor",100,29290610,XCorr,6.1019797,0.8695000,,,,4.3490000489754E-10,
SSFGSSGSGYGGGGGSGAGSGNR,ph,S,187,true,"Tissue atlas Arabidopsis - ProteomicsDB",114,32188942,"MaxQuant score",443.6900000,0.9991830,,,,0,
SGSGYGGGGGSGAGSGNR,nt,S,188,true,"Tic56 chloroplast import - tic56-1",89c,25588737,XCorr,3.2380016,,,,,,
SSFGSSGSGYGGGGGSGAGSGNR,ph,S,188,true,"Conserved plant phosphoproteome - Arabidopsis",61a,20466843,"MASCOT Score",96.0000000,1.0000000,,,,,
SSFGSSGSGYGGGGGSGAGSGNR,ph,S,188,true,"Tissue atlas Arabidopsis - ProteomicsDB",114,32188942,"MaxQuant score",374.7100000,0.9770140,,,,0,
SSFGSSGSGYGGGGGSGAGSGNR,ph,S,190,true,"Conserved plant phosphoproteome - Arabidopsis",61a,20466843,"MASCOT Score",73.0000000,1.0000000,,,,,
SSFGSSGSGYGGGGGSGAGSGNR,ph,S,190,true,"Tissue atlas Arabidopsis - ProteomicsDB",114,32188942,"MaxQuant score",333.6300000,0.9802310,,,,0,
SSFGSSGSGYGGGGGSGAGSGNR,ph,S,198,true,"Conserved plant phosphoproteome - Arabidopsis",61a,20466843,"MASCOT Score",66.0000000,1.0000000,,,,,
SSFGSSGSGYGGGGGSGAGSGNR,ph,S,198,true,"srk2dei ABA signaling phopshoproteomics",83,23572148,"MASCOT Score",39.0000000,,,,,,-0.0034000
GFGFVTYDSSQEVQNAIK,ph,S,254,true,"TOR Kinase and ABA Receptor",100,29290610,XCorr,4.9850950,0.8993000,,,,3.1269998999051E-6,
SLDGADLDGR,nt,S,264,true,"Metacaspase9 substrates - in vitro rMC9",51c,23964026,"MASCOT Score",71.0000000,,1.9751356,,NO,,0.1839056
SLDGADLDGR,nt,S,264,true,"Arg/N-end rule seed, prt6 vs. Wt",99,29168982,"MASCOT Score",30.4800000,,0.1086169,0.7200851,NO,0.074869997799397,-2.1375649
