Peptide,PTM,ModifiedAA,ModifiedPosition,PeptideUniqueToGene,ExperimentDesc,ExpID,PubmedID,ScoreType,IdentScore,LocProb,Log2FChange,PQ-val,QuantSig,PEP,MassErrorPPM
ELEMNYYKESCPKAEEIIR,nt,E,29,true,"Arg/N-end rule pathway Roots",80,25728785,"MASCOT Score",48.2200000,,,,,1.5679999705753E-5,
NLFHDCVVK,sno,C,72,true,"hot5-4 / wildtype, FAT-switch S-nitrosoproteome",169,37277371,,,,,,,,
SCDASLLLETAR,sno,C,77,true,"hot5-4 / wildtype, FAT-switch S-nitrosoproteome",169,37277371,,,,-0.6215724,0.0257053,YES,,
DASLLLETAR,nt,D,78,true,"Arg/N-end rule seed, prt6 vs. Wt",99,29168982,"MASCOT Score",31.9200000,,-0.4053193,0.0105929,NO,0.086860001087189,-0.8241088
GVESEQKSK,ac,K,94,true,"Quantitative Acetylproteomics",101,29440448,,,,,,,,
GVESEQKSKR,ub,K,94,true,"Arabidopsis ubiquitination COFRADIC",40,26744219,"MaxQuant Score",52.2470000,0.8280000,,,,0.0089999996125698,0.6530000
ADIVALSAR,nt,A,125,true,"Arg/N-end rule seed, prt6 vs. Wt",99,29168982,"MASCOT Score",41.0600000,,-0.9373624,0.0110384,NO,0.070340000092983,-0.8749640
CPSPTPDPNAVLYSR,sno,C,231,true,"hot5-4 / wildtype, FAT-switch S-nitrosoproteome",169,37277371,,,,,,,,
DELATDPR,nt,D,273,true,"Arg/N-end rule seed, prt6 vs. Wt",99,29168982,"MASCOT Score",64.1800000,,-0.5908747,0.6172379,NO,0.038610000163317,-0.4350530
AADNNYFHE,nt,A,289,true,"Arg/N-end rule seed, prt6 vs. Wt",99,29168982,"MASCOT Score",33.7800000,,0.0255206,0.8464963,NO,0.011640000157058,-2.6661026
