Peptide,PTM,ModifiedAA,ModifiedPosition,PeptideUniqueToGene,ExperimentDesc,ExpID,PubmedID,ScoreType,IdentScore,LocProb,Log2FChange,PQ-val,QuantSig,PEP,MassErrorPPM
SNGGGVDAMLCGGDIK,ph,S,9,true,"Tissue atlas Arabidopsis - ProteomicsDB",114,32188942,"MaxQuant score",150.5900000,1.0000000,,,,8.6199297699707E-11,
SNGGGVDAMLCGGDIK,sno,C,19,true,"hot5-4 / wildtype, FAT-switch S-nitrosoproteome",169,37277371,,,,,,,,
GSHLDEVKR,ac,K,54,false,"Quantitative Acetylproteomics",101,29440448,,,,,,,,
GTDSYGVTTGFGATSHR,ph,T,121,false,"Tissue atlas Arabidopsis - ProteomicsDB",114,32188942,"MaxQuant score",101.4800000,0.9280870,,,,3.9409201235685E-7,
TKNGVALQK,ub,K,132,true,"Ubiquitination Membrane Proteins",120,33585938,,,,,,,,
FLNAGIFGSTK,ph,S,152,true,"TOR Kinase and ABA Receptor",100,29290610,XCorr,3.9586856,0.9325000,,,,6.5829999584821E-6,
FLNAGIFGSTK,ph,S,152,true,"Lateral root-induction - NAA vs control",106,23328941,"MASCOT Score",23.0000000,,,,,,
FLNAGIFGSTK,ph,S,152,true,"Tissue atlas Arabidopsis - ProteomicsDB",114,32188942,"MaxQuant score",205.8700000,0.9265110,,,,1.6968999577744E-24,
ETSHTLPHSATR,ph,S,163,true,"srk2dei ABA signaling phopshoproteomics",83,23572148,"MASCOT Score",25.0000000,,,,,,0.0001000
AIHGGNFQGTPIGVSMDNTR,ph,T,412,false,"Tissue atlas Arabidopsis - ProteomicsDB",114,32188942,"MaxQuant score",111.4000000,0.9999900,,,,8.9668003924737E-12,
QTVKNTVSQVAK,ac,K,546,false,"Quantitative Acetylproteomics",101,29440448,,,,,,,,
NTVSQVAKK,ac,K,554,false,"Quantitative Acetylproteomics",101,29440448,,,,,,,,
EQVYTYADDPCSATYPLIQK,sno,C,592,true,"hot5-4 / wildtype, FAT-switch S-nitrosoproteome",169,37277371,,,,,,,,
AVLPKEVEAAR,ub,K,641,false,"Ubiquitination Membrane Proteins",120,33585938,,,,,,,,
AVLPKEVEAAR,ub,K,641,false,"upl3 mutant / wildtype",168,35926874,"MaxQuant score",133.8100000,1.0000000,1.9759970,0.1160830,NO,4.4084798034305E-9,-0.5093400
