Peptide,PTM,ModifiedAA,ModifiedPosition,PeptideUniqueToGene,ExperimentDesc,ExpID,PubmedID,ScoreType,IdentScore,LocProb,Log2FChange,PQ-val,QuantSig,PEP,MassErrorPPM
STVVSLIER,ph,T,411,false,"Lateral root-induction - NAA vs control",106,23328941,"MASCOT Score",21.0000000,,,,,,
VANAHSFIIKLPDGFDTQVGER,ub,K,491,true,"Ubiquitination Membrane Proteins",120,33585938,,,,,,,,
KSSARPSSAR,ph,S,621,true,"atm and atr DNA damage response",88,25561503,"MASCOT Score",24.0000000,0.9750000,,,,,-1.2300000
KSSARPSSAR,ph,S,622,true,"atm and atr DNA damage response",88,25561503,"MASCOT Score",24.0000000,0.9750000,,,,,-1.2300000
PSSARNSVSSPIMTR,ph,S,627,true,"atm and atr DNA damage response",88,25561503,"MASCOT Score",32.0000000,0.9740000,,,,,-0.3700000
PSSARNSVSSPIMTR,ph,S,631,true,"atm and atr DNA damage response",88,25561503,"MASCOT Score",28.0000000,0.9320000,,,,,-0.6400000
NSVSSPIMTR,ph,S,631,true,"Plasmamembrane phosphorylation",20,15308754,,,,,,,,
NSVSSPIMTR,ph,S,631,true,"atm and atr DNA damage response",88,25561503,"MASCOT Score",31.0000000,1.0000000,,,,,-0.6600000
NSVSSPIMTR,ph,S,631,true,"Tissue atlas Arabidopsis - ProteomicsDB",114,32188942,"MaxQuant score",123.9500000,1.0000000,,,,0.00021256800391711,
PSSARNSVSSPIMTR,ph,S,633,true,"atm and atr DNA damage response",88,25561503,"MASCOT Score",32.0000000,1.0000000,,,,,-0.3700000
NSVSSPIMTR,ph,S,633,true,"atm and atr DNA damage response",88,25561503,"MASCOT Score",42.0000000,0.9820000,,,,,0.7800000
NSVSSPIMTR,ph,S,633,true,"Tissue atlas Arabidopsis - ProteomicsDB",114,32188942,"MaxQuant score",70.4880000,0.7861510,,,,0.0017107600579038,
PSSARNSVSSPIMTR,ph,S,634,true,"atm and atr DNA damage response",88,25561503,"MASCOT Score",32.0000000,0.9870000,,,,,-0.3700000
NSVSSPIMTR,ph,S,634,true,"Phosphorylation Early Elicitor Signaling",23,17317660,,,,,,,,
NSVSSPIMTR,ph,S,634,true,"Phytohormone-responsive phosphoproteins",34,20374526,"MASCOT Score",44.0000000,,,,,,4.2443600
NSVSSPIMTR,ph,S,634,true,"STN8 phosphoproteome",38,21768351,"MASCOT Score",56.4000000,,,,,,
NSVSSPIMTR,ph,S,634,true,"Large-scale phosphorylation discovery",44,23111157,XCorr,3.1550000,,,,,,
NSVSSPIMTR,ph,S,634,true,"Tyrosine phosphorylation in Arabidopsis",59,18463617,"MASCOT Score",48.0000000,,,,,,-0.5899682
NSVSSPIMTR,ph,S,634,true,"Chloroplast kinase substrates",60,19376835,"MASCOT Score",43.5800000,,,,,,-1.3027800
NSVSSPIMTR,ph,S,634,true,"LAXIC - ABA stress",84a,23660473,XCorr,2.7500000,0.9950000,,,,0.0025466000661254,
NSVSSPIMTR,ph,S,634,true,"atm and atr DNA damage response",88,25561503,"MASCOT Score",48.0000000,0.9970000,,,,,0.9200000
NSVSSPIMTR,ph,S,634,true,"TOR Kinase and ABA Receptor",100,29290610,XCorr,3.4794261,0.9356000,,,,0.00015750000602566,
NSVSSPIMTR,ph,S,634,true,"Tissue atlas Arabidopsis - ProteomicsDB",114,32188942,"MaxQuant score",185.3000000,0.9998260,,,,5.6299498396584E-10,
NSSYGRSPYSR,ph,S,641,true,"Tissue atlas Arabidopsis - ProteomicsDB",114,32188942,"MaxQuant score",63.7540000,0.9969280,,,,0.0053080199286342,
NSSYGRSPYSR,ph,S,642,true,"atm and atr DNA damage response",88,25561503,"MASCOT Score",30.0000000,0.8260000,,,,,0.0100000
NSSYGRSPYSR,ph,S,642,true,"Tissue atlas Arabidopsis - ProteomicsDB",114,32188942,"MaxQuant score",153.3200000,0.9997330,,,,2.9726801020757E-9,
NSSYGRSPYSR,ph,S,646,true,"atm and atr DNA damage response",88,25561503,"MASCOT Score",26.0000000,0.9230000,,,,,-0.4600000
NSSYGRSPYSR,ph,S,646,true,"Tissue atlas Arabidopsis - ProteomicsDB",114,32188942,"MaxQuant score",167.0100000,0.9999960,,,,3.6948201442843E-11,
NSSYGRSPYSR,ph,Y,648,true,"atm and atr DNA damage response",88,25561503,"MASCOT Score",30.0000000,0.8910000,,,,,0.0100000
DQANSFWRLAK,ph,S,685,true,"Tissue atlas Arabidopsis - ProteomicsDB",114,32188942,"MaxQuant score",67.0800000,1.0000000,,,,0.0092126503586769,
KTEIEPDDPDTTPVPDR,ph,T,1014,true,"Tissue atlas Arabidopsis - ProteomicsDB",114,32188942,"MaxQuant score",80.3160000,0.8245450,,,,0.00010635299986461,
TLALVGPSGCGK,sno,C,1063,true,"hot5-4 / wildtype, FAT-switch S-nitrosoproteome",169,37277371,,,,,,,,
GVQLSGGQKQR,ac,K,1168,false,"Quantitative Acetylproteomics",101,29440448,,,,,,,,
FTHTQVIGMTSGSSSR,ph,S,1275,true,"Tissue atlas Arabidopsis - ProteomicsDB",114,32188942,"MaxQuant score",208.5200000,0.9131550,,,,0,
FTHTQVIGMTSGSSSR,ph,S,1277,true,"atm and atr DNA damage response",88,25561503,"MASCOT Score",30.0000000,0.9790000,,,,,-0.5900000
