Peptide,PTM,ModifiedAA,ModifiedPosition,PeptideUniqueToGene,ExperimentDesc,ExpID,PubmedID,ScoreType,IdentScore,LocProb,Log2FChange,PQ-val,QuantSig,PEP,MassErrorPPM
TQSQTNDGAGAGAVTTVESVPPQPQ,nt,T,2,true,"Arg/N-end rule seed, prt6 vs. Wt",99,29168982,"MASCOT Score",41.9500000,,-0.0945686,0.8680968,NO,0.0084060002118349,-2.2422674
TQSQTNDGAGAGAVTTVE,nt,T,2,true,"Arg/N-end rule seed, prt6 vs. Wt",99,29168982,"MASCOT Score",90.7100000,,-0.9522333,0.0088798,NO,9.3719997040775E-12,-7.7800505
TQSQTNDGAGAGAVTTVE,nt,T,2,true,"HUNTER N-terminome: legumain, GluC and trypsin",119,31951383,"MaxQuant score",132.8600000,,,,,,
TQSQTNDGAGAGAVTTVE,nt,T,2,true,"Arabidopsis translation initiation landscape - NT",167b,35069635,,,,,,,,
AKEDEIEKR,ub,K,71,false,"Arabidopsis ubiquitination COFRADIC",40,26744219,"MaxQuant Score",94.6920000,1.0000000,,,,0.0010000000474975,0.1990000
AKEDEIEKR,ac,K,77,false,"Quantitative Acetylproteomics",101,29440448,,,,,,,,
AKEDEIEKR,ub,K,77,false,"Arabidopsis ubiquitination COFRADIC",40,26744219,"MaxQuant Score",63.0760000,1.0000000,,,,0.0080000003799796,-0.7020000
KEVSVVR,ub,K,116,true,"Arabidopsis ubiquitination COFRADIC",40,26744219,"MaxQuant Score",108.0900000,1.0000000,,,,0.0080000003799796,-1.5950000
ELKPLGSTVQK,ph,S,137,false,"atm and atr DNA damage response",88,25561503,"MASCOT Score",30.0000000,0.9480000,,,,,-3.0900000
ELKPLGSTVQK,ph,S,137,false,"Tissue atlas Arabidopsis - ProteomicsDB",114,32188942,"MaxQuant score",134.9200000,0.8479550,,,,4.5180699999037E-6,
EYKEALDTFNEKNR,ub,K,147,false,"Arabidopsis ubiquitination COFRADIC",40,26744219,"MaxQuant Score",112.4200000,1.0000000,,,,1.3920000075244E-18,0.2950000
EYKEALDTFNEK,ub,K,147,false,"upl3 mutant / wildtype",168,35926874,"MaxQuant score",132.5000000,1.0000000,0.0989585,,,1.2594299825253E-8,0.4061900
EALDTFNEKNR,ac,K,156,false,"Quantitative Acetylproteomics",101,29440448,,,,,,,,
EYKEALDTFNEKNR,ub,K,156,false,"Arabidopsis ubiquitination COFRADIC",40,26744219,"MaxQuant Score",148.5200000,1.0000000,,,,5.2839999212118E-31,0.3580000
LEELSKSIETV,me2,K,190,true,"Arabidopsis protein methylome",123,31809900,"MaxQuant Score",67.3850000,1.0000000,,,,0.012251400388777,1.1979000
LEELSKSIETV,ub,K,190,true,"upl3 mutant / wildtype",168,35926874,"MaxQuant score",91.5490000,1.0000000,-0.5479318,,,0.00088446901645511,-1.1054000
