Peptide,PTM,ModifiedAA,ModifiedPosition,PeptideUniqueToGene,ExperimentDesc,ExpID,PubmedID,ScoreType,IdentScore,LocProb,Log2FChange,PQ-val,QuantSig,PEP,MassErrorPPM
ARKPSYDSDSSSLATTASEKLR,nt,A,52,true,"Stromal N-terminome",96,26371235,"MASCOT Score",61.0100000,,,,,,
ARKPSYDSDSSSLATTASEKLR,nt,A,52,true,"HUNTER N-terminome: legumain, GluC and trypsin",119,31951383,"MaxQuant score",68.4200000,,,,,,
ARKPSYDSDSSSLATTASE,nt,A,52,true,"HUNTER N-terminome: legumain, GluC and trypsin",119,31951383,"MaxQuant score",119.2300000,,,,,,
RKPSYDSDSSSLATTASEKLR,nt,R,53,true,"Stromal N-terminome",96,26371235,"MASCOT Score",72.0400000,,,,,,
RKPSYDSDSSSLATTASE,nt,R,53,true,"HUNTER N-terminome: legumain, GluC and trypsin",119,31951383,"MaxQuant score",84.1400000,,,,,,
RKPSYDSDSSSLATTASEKLR,nta,R,53,true,"Stromal N-terminome",96,26371235,"MASCOT Score",72.0400000,,,,,,
RKPSYDSDSSSLATTASE,nta,R,53,true,"HUNTER N-terminome: legumain, GluC and trypsin",119,31951383,"MaxQuant score",62.4080000,,,,,,
RKPSYDSDSSSLATTASE,nta,R,53,true,"Arabidopsis translation initiation landscape - NTA",167a,35069635,,,,,,,,
KPSYDSDSSSLATTASEK,ph,S,59,true,"Large-scale phosphorylation discovery",44,23111157,XCorr,5.1990000,,,,,,
KPSYDSDSSSLATTASEK,ph,S,59,true,"Tissue atlas Arabidopsis - ProteomicsDB",114,32188942,"MaxQuant score",203.2300000,0.9978790,,,,0,
LRGHQSDSSSSASDQVQSR,ph,S,77,true,"TOR Kinase and ABA Receptor",100,29290610,XCorr,2.8977084,0.9088000,,,,1.3079999916954E-5,
GHQSDSSSSASDQVQSR,ph,S,77,true,"atm and atr DNA damage response",88,25561503,"MASCOT Score",59.0000000,1.0000000,,,,,0.4300000
GHQSDSSSSASDQVQSR,ph,S,77,true,"Tissue atlas Arabidopsis - ProteomicsDB",114,32188942,"MaxQuant score",127.7800000,0.9999620,,,,1.1242899944364E-9,
MSHSVDQEVGQRK,mox,M,138,true,"cat2 Methionine oxidation - 3h stress",62b,25693801,"MASCOT Score",48.0000000,,-1.7566210,,NO,,
KIPPPGDGKR,ac,K,158,true,"Quantitative Acetylproteomics",101,29440448,,,,,,,,
IRMDTPSGIK,mox,M,274,false,"cat2 Methionine oxidation - 1h stress",62a,25693801,"MASCOT Score",45.0000000,,-0.2055118,,NO,,
VIAGNNGSYDKCR,so,C,702,true,"Arabidopsis S-sulfenylation chemoproteomics",108,31578252,"pFind PSM Score",0.0448523,,1.8557700,,,,0.9290298
LDDSAEFFTSDGR,ph,S,805,true,"STN8 phosphoproteome",38,21768351,"MASCOT Score",83.3800000,,,,,,-1.4886200
LDDSAEFFTSDGR,ph,S,805,true,"atm and atr DNA damage response",88,25561503,"MASCOT Score",82.0000000,1.0000000,,,,,-0.1300000
LDDSAEFFTSDGR,ph,S,805,true,"Phospho cell culture sucrose/TOR",109,30833711,,,0.9998280,,,,,
LDDSAEFFTSDGR,ph,S,805,true,"Tissue atlas Arabidopsis - ProteomicsDB",114,32188942,"MaxQuant score",269.9500000,1.0000000,,,,0,
