Peptide,PTM,ModifiedAA,ModifiedPosition,PeptideUniqueToGene,ExperimentDesc,ExpID,PubmedID,ScoreType,IdentScore,LocProb,Log2FChange,PQ-val,QuantSig,PEP,MassErrorPPM
VADSIDTNSDDTLTR,ph,T,13,true,"atm and atr DNA damage response",88,25561503,"MASCOT Score",48.0000000,1.0000000,,,,,0.2600000
VADSIDTNSDDTLTR,ph,T,13,true,"Tissue atlas Arabidopsis - ProteomicsDB",114,32188942,"MaxQuant score",124.9900000,0.9991440,,,,6.5927902141993E-6,
VADSIDTNSDDTLTR,ph,S,15,true,"atm and atr DNA damage response",88,25561503,"MASCOT Score",59.0000000,0.9970000,,,,,-1.7100000
VADSIDTNSDDTLTR,ph,S,15,true,"Tissue atlas Arabidopsis - ProteomicsDB",114,32188942,"MaxQuant score",273.3900000,0.9981120,,,,0,
VADSIDTNSDDTLTR,ph,T,18,true,"atm and atr DNA damage response",88,25561503,"MASCOT Score",59.0000000,0.9970000,,,,,-1.7100000
VADSIDTNSDDTLTR,ph,T,18,true,"Tissue atlas Arabidopsis - ProteomicsDB",114,32188942,"MaxQuant score",231.3700000,0.9846270,,,,0,
TTPLSLSSSASK,ph,T,50,true,"Tissue atlas Arabidopsis - ProteomicsDB",114,32188942,"MaxQuant score",105.0900000,0.8683000,,,,0.00055561301996931,
DVPSGEPETNDVPCEEQDDR,ph,S,173,true,"Tissue atlas Arabidopsis - ProteomicsDB",114,32188942,"MaxQuant score",110.6000000,0.9997800,,,,1.1566200254498E-11,
DVPCVEQESEDVPCVEQER,ph,S,224,true,"Tissue atlas Arabidopsis - ProteomicsDB",114,32188942,"MaxQuant score",264.6900000,1.0000000,,,,0,
EKLDQTMDCEEQENTDVLCEEK,ph,T,259,true,"Tissue atlas Arabidopsis - ProteomicsDB",114,32188942,"MaxQuant score",50.7670000,0.9879560,,,,0.00070127798244357,
LANLGVSP,ph,S,413,true,"atm and atr DNA damage response",88,25561503,"MASCOT Score",34.0000000,1.0000000,,,,,-0.2800000
