Peptide,PTM,ModifiedAA,ModifiedPosition,PeptideUniqueToGene,ExperimentDesc,ExpID,PubmedID,ScoreType,IdentScore,LocProb,Log2FChange,PQ-val,QuantSig,PEP,MassErrorPPM
EVAVSQNIAGKHIDR,ac,K,53,true,"Quantitative Acetylproteomics",101,29440448,,,,,,,,
VFTFDKVFGPSAQQK,ph,T,60,true,"Tissue atlas Arabidopsis - ProteomicsDB",114,32188942,"MaxQuant score",45.8440000,0.9995410,,,,0.0062129301950336,
SAPCGGLPAEAGVIPR,sno,C,120,true,"hot5-4 / wildtype, FAT-switch S-nitrosoproteome",169,37277371,,,,,,,,
VAAEEKQKKPLPLMEDGK,ub,K,181,true,"Protein ubiquitination during photomorphogenesis",3,28461270,,,,,,,,
VASCLSQQNVHLQGVNK,so,C,559,true,"Arabidopsis S-sulfenylation chemoproteomics",108,31578252,"pFind PSM Score",0.0800248,,0.9523800,,,,-1.7584924
QVTDVSSLVR,ph,S,853,true,"Tissue atlas Arabidopsis - ProteomicsDB",114,32188942,"MaxQuant score",149.2300000,0.8620320,,,,8.1181502764593E-7,
QVTDVSSLVR,ph,S,854,true,"Tissue atlas Arabidopsis - ProteomicsDB",114,32188942,"MaxQuant score",109.7200000,0.9474330,,,,0.00022079999325797,
SACDSNEQHDAEVDSAR,ph,S,858,true,"Tissue atlas Arabidopsis - ProteomicsDB",114,32188942,"MaxQuant score",89.6590000,0.9999280,,,,9.5062896434683E-5,
SACDSNEQHDAEVDSAR,ph,S,862,true,"Tissue atlas Arabidopsis - ProteomicsDB",114,32188942,"MaxQuant score",95.9960000,0.9999960,,,,1.5643399819965E-6,
AQETFQQQYMEYEPTGATPTKNEPEIPTK,ph,T,952,true,"SnRK2 protein kinase substrates",85,23776212,XCorr,4.6343002,0.7950000,,,,0.0015976600116119,
AQETFQQQYMEYEPTGATPTK,ph,T,952,true,"TOR Kinase and ABA Receptor",100,29290610,XCorr,5.0146494,0.8448000,,,,1.987999951325E-7,
AQETFQQQYMEYEPTGATPTK,ph,T,952,true,"Phospho cell culture sucrose/TOR",109,30833711,,,0.8746360,,,,,
AQETFQQQYMEYEPTGATPTK,ph,T,952,true,"Tissue atlas Arabidopsis - ProteomicsDB",114,32188942,"MaxQuant score",361.1500000,0.9971810,,,,0,
AQETFQQQYMEYEPTGATPTKNEPEIPTK,ph,T,954,true,"Tissue atlas Arabidopsis - ProteomicsDB",114,32188942,"MaxQuant score",188.8000000,0.7746480,,,,0,
SPLSQVN,ph,S,1003,true,"Tissue atlas Arabidopsis - ProteomicsDB",114,32188942,"MaxQuant score",169.7700000,1.0000000,,,,0.0055160098709166,
