Peptide,PTM,ModifiedAA,ModifiedPosition,PeptideUniqueToGene,ExperimentDesc,ExpID,PubmedID,ScoreType,IdentScore,LocProb,Log2FChange,PQ-val,QuantSig,PEP,MassErrorPPM
TLGSGSSVVVPRNFRLLEE,nt,T,2,true,"Arabidopsis translation initiation landscape - NT",167b,35069635,,,,,,,,
TLGSGSSVVVPRN,nt,T,2,true,"HUNTER N-terminome: legumain, GluC and trypsin",119,31951383,"MaxQuant score",234.9200000,,,,,,
TLGSGSSVVVPR,nt,T,2,true,"Characterization plant N-terminal acetylation",6,22223895,"MASCOT Score",67.6100000,,,,,,
TLGSGSSVVVPR,nt,T,2,true,"Arg/N-end rule pathway Roots",80,25728785,"MASCOT Score",72.3900000,,,,,6.269000004977E-5,
TLGSGSSVVVPR,nt,T,2,true,"N-terminal ChaFRADIC",92,26010716,"MASCOT Score",72.8000000,,,,,2.1019999962846E-7,
TLGSGSSVVVPR,nt,T,2,true,"Stromal N-terminome",96,26371235,"MASCOT Score",76.3500000,,,,,,
TLGSGSSVVVPR,nt,T,2,true,"Arg/N-end rule seed, prt6 vs. Wt",99,29168982,"MASCOT Score",119.8500000,,0.0267894,0.7242156,NO,0.00036790000740439,-0.9863008
TLGSGSSVVVPR,nt,T,2,true,"FtsH12 N-terminome: WT / FtsH12 knockdown miRNA",118,33216923,"MaxQuant score",138.2600000,,,,,1.2700000695531E-7,
TLGSGSSVVVPR,nt,T,2,true,"HUNTER N-terminome: legumain, GluC and trypsin",119,31951383,"MaxQuant score",73.4990000,,,,,,
TLGSGSSVVV,nt,T,2,true,"N-term acetylation drought responses",5,26184543,,,,,,,,
TLGSGSSVVVPR,nta,T,2,true,"N-terminal ChaFRADIC",92,26010716,"MASCOT Score",63.8300000,,,,,0.00044070000876673,
TLGSGSSVVVPR,nta,T,2,true,"Arg/N-end rule seed, prt6 vs. Wt",99,29168982,"MASCOT Score",119.8500000,,,,,0.00036790000740439,-0.9863008
TLGSGSSVVVPR,nta,T,2,true,"FtsH12 N-terminome: WT / FtsH12 knockdown miRNA",118,33216923,"MaxQuant score",90.6850000,,,,,0.0031781001016498,
TLGSGSSVVVPR,nta,T,2,true,"HUNTER N-terminome: legumain, GluC and trypsin",119,31951383,"MaxQuant score",81.3380000,,,,,,
TLGSGSSVVVPR,ph,T,2,true,"Chloroplast kinase substrates",60,19376835,"MASCOT Score",38.4700000,,,,,,0.3877130
TLGSGSSVVVPR,ph,T,2,true,"srk2dei ABA signaling phopshoproteomics",83,23572148,"MASCOT Score",59.0000000,,,,,,-0.0005000
TLGSGSSVVVPR,ph,T,2,true,"atm and atr DNA damage response",88,25561503,"MASCOT Score",74.0000000,0.9950000,,,,,0.4900000
TLGSGSSVVVPR,ph,T,2,true,"Tissue atlas Arabidopsis - ProteomicsDB",114,32188942,"MaxQuant score",198.9700000,1.0000000,,,,1.8994999486187E-24,
TLGSGSSVVVPR,ph,S,5,true,"srk2dei ABA signaling phopshoproteomics",83,23572148,"MASCOT Score",63.0000000,,,,,,0.0011000
TLGSGSSVVVPR,ph,S,5,true,"Tissue atlas Arabidopsis - ProteomicsDB",114,32188942,"MaxQuant score",161.8700000,0.9998000,,,,4.3720299602867E-10,
TLGSGSSVVVPR,ph,S,7,true,"Tissue atlas Arabidopsis - ProteomicsDB",114,32188942,"MaxQuant score",168.8200000,0.8603470,,,,1.1970400053672E-14,
TLGSGSSVVVPR,ph,S,8,true,"Tissue atlas Arabidopsis - ProteomicsDB",114,32188942,"MaxQuant score",139.7800000,0.9653010,,,,1.2988799653613E-6,
GEKGIGDGTVSYGMDDGDDIYMR,nt,G,24,false,"Arabidopsis translation initiation landscape - NT",167b,35069635,,,,,,,,
GEKGIGDGTVSYGMDDGDDIYMR,ub,K,26,false,"Arabidopsis ubiquitination COFRADIC",40,26744219,"MaxQuant Score",105.5100000,1.0000000,,,,1.393999963824E-36,-0.2040000
GEKGIGDGTVSYGMDDGDDIYMR,ub,K,26,false,"upl3 mutant / wildtype",168,35926874,"MaxQuant score",66.6130000,1.0000000,,,,7.0265000431391E-6,0.1691200
GIGDGTVSYGMDDGDDIYMR,nt,G,27,false,"Metacaspase9 substrates - in vitro rMC9",51c,23964026,"MASCOT Score",37.0000000,,2.1665908,,NO,,-0.4915300
EGRIYQLKLFC,nt,E,61,false,"Arabidopsis translation initiation landscape - NT",167b,35069635,,,,,,,,
LFCDKDYPEKPPTVR,sno,C,71,false,"Site-specific nitrosomeproteomic id - gsnor1-3",90a,25699590,XCorr,4.2877898,,,,,2.0400000266818E-7,-4.7461378
LFCDKDYPEKPPTVR,sno,C,71,false,"Site-specific nitrosomeproteomic id - gsnor1-3",90b,25699590,XCorr,4.0700000,,,,,0.00318400003016,-6.6900000
LFCDKDYPEKPPTVR,so,C,71,false,"S-sulfenylation site detection using YAP1C",110,32714340,,,,,,,,
LFCDKDYPEKPPTVR,ub,K,73,false,"upl3 mutant / wildtype",168,35926874,"MaxQuant score",69.4560000,0.9940000,,,,8.5430299805012E-5,0.4640800
LFCDKDYPEKPPTVR,ub,K,78,false,"upl3 mutant / wildtype",168,35926874,"MaxQuant score",82.8370000,0.9970000,0.0565835,0.9513400,NO,2.6306299332646E-5,0.9243200
INMTCVNHDTGVVDSK,sno,C,92,true,"Site-specific nitrosomeproteomic id - gsnor1-3",90a,25699590,XCorr,3.5141108,,,,,3.4450000384822E-5,-3.9336453
INMTCVNHDTGVVDSK,sno,C,92,true,"Site-specific nitrosomeproteomic id - gsnor1-3",90b,25699590,XCorr,3.9000000,,,,,9.699999645818E-5,-4.7200000
INMTCVNHDTGVVDSK,so,C,92,true,"Arabidopsis S-sulfenylation chemoproteomics",108,31578252,"pFind PSM Score",0.0002685,,1.2972300,,,,-1.1315586
EMAASHNRK,mox,M,128,true,"cat2 Methionine oxidation - 1h stress",62a,25693801,"MASCOT Score",30.0000000,,0.2816835,,NO,,
KLVQPPEGTFF,ub,K,135,true,"Arabidopsis ubiquitination COFRADIC",40,26744219,"MaxQuant Score",102.5200000,1.0000000,,,,5.2420000429265E-7,0.0410000
KLVQPPEGTFF,ub,K,135,true,"upl3 mutant / wildtype",168,35926874,"MaxQuant score",104.2200000,1.0000000,0.1978654,0.3745400,NO,0.0014021700480953,0.5853400
