Peptide,PTM,ModifiedAA,ModifiedPosition,PeptideUniqueToGene,ExperimentDesc,ExpID,PubmedID,ScoreType,IdentScore,LocProb,Log2FChange,PQ-val,QuantSig,PEP,MassErrorPPM
AAYFHGNPPEISAGSD,nta,A,2,true,"HUNTER N-terminome: legumain, GluC and trypsin",119,31951383,"MaxQuant score",157.6800000,,,,,,
VQYSLYGSHQVDPTHQQAACETPR,ph,T,132,true,"Tissue atlas Arabidopsis - ProteomicsDB",114,32188942,"MaxQuant score",382.1200000,1.0000000,,,,0,
VGSGSTGSGVTNGIANLVSSK,ph,S,176,true,"Tissue atlas Arabidopsis - ProteomicsDB",114,32188942,"MaxQuant score",279.4700000,0.9980210,,,,0,
VGSGSTGSGVTNGIANLVSSK,ph,S,178,true,"Tissue atlas Arabidopsis - ProteomicsDB",114,32188942,"MaxQuant score",338.6700000,0.9927030,,,,0,
VGSGSTGSGVTNGIANLVSSK,ph,T,179,true,"Tissue atlas Arabidopsis - ProteomicsDB",114,32188942,"MaxQuant score",175.5200000,0.8877940,,,,4.0049000697019E-36,
VGSGSTGSGVTNGIANLVSSK,ph,S,181,true,"Tissue atlas Arabidopsis - ProteomicsDB",114,32188942,"MaxQuant score",205.8400000,0.9976760,,,,0,
AAQELLDEVVNADSDDMNAK,ph,S,211,true,"Tissue atlas Arabidopsis - ProteomicsDB",114,32188942,"MaxQuant score",46.4150000,1.0000000,,,,0.0051271701231599,
KGSCGNDKPVGESSAGAGGEGSGGGAEAAGK,ph,S,227,true,"Tissue atlas Arabidopsis - ProteomicsDB",114,32188942,"MaxQuant score",117.4200000,0.9978510,,,,6.5717102229237E-35,
KGSCGNDKPVGESSAGAGGEGSGGGAEAAGK,ph,S,238,true,"Col-0 callus - FC Col-0 vs. Col-0 Xray",111a,31410901,,65.7100000,,-3.1104377,0.0000000,NO,,0.5346081
KGSCGNDKPVGESSAGAGGEGSGGGAEAAGK,ph,S,238,true,"Col-0 X-ray callus - FC Col-0 vs. Col-0 Xray",111b,31410901,,65.7100000,,-3.1104377,0.0000000,NO,,0.5346081
KGSCGNDKPVGESSAGAGGEGSGGGAEAAGK,ph,S,238,true,"atm callus - FC atm vs. atm Xray",111c,31410901,,65.7100000,,7.0452514,0.0000000,NO,,0.5346081
KGSCGNDKPVGESSAGAGGEGSGGGAEAAGK,ph,S,238,true,"atm-3 X-ray callus - FC atm vs. atm Xray",111d,31410901,,65.7100000,,7.0452514,0.0000000,NO,,0.5346081
KGSCGNDKPVGESSAGAGGEGSGGGAEAAGK,ph,S,238,true,"Tissue atlas Arabidopsis - ProteomicsDB",114,32188942,"MaxQuant score",226.9300000,0.9441640,,,,0,
KGSCGNDKPVGESSAGAGGEGSGGGAEAAGK,ph,S,246,true,"Tissue atlas Arabidopsis - ProteomicsDB",114,32188942,"MaxQuant score",192.9600000,1.0000000,,,,0,
SLGEEDSVSGVGR,ph,S,347,true,"atm and atr DNA damage response",88,25561503,"MASCOT Score",63.0000000,0.9520000,,,,,-0.7800000
SLGEEDSVSGVGR,ph,S,347,true,"Tissue atlas Arabidopsis - ProteomicsDB",114,32188942,"MaxQuant score",209.2200000,0.9999920,,,,4.2292602964772E-39,
SLGEEDSVSGVGR,ph,S,349,true,"atm and atr DNA damage response",88,25561503,"MASCOT Score",69.0000000,1.0000000,,,,,-0.7000000
SLGEEDSVSGVGR,ph,S,349,true,"Tissue atlas Arabidopsis - ProteomicsDB",114,32188942,"MaxQuant score",192.6800000,0.9970130,,,,2.5614399943401E-30,
NMGSMEKTPLDQSNEDSASK,ph,S,465,true,"Tissue atlas Arabidopsis - ProteomicsDB",114,32188942,"MaxQuant score",70.4130000,0.9813040,,,,6.0007201682311E-5,
NMGSMEKTPLDQSNEDSASK,ph,T,469,true,"Tissue atlas Arabidopsis - ProteomicsDB",114,32188942,"MaxQuant score",96.7930000,0.9983600,,,,1.6231100019581E-8,
TPLDQSNEDSASK,ph,S,474,true,"Tissue atlas Arabidopsis - ProteomicsDB",114,32188942,"MaxQuant score",134.3700000,0.9983870,,,,4.5355700422078E-5,
TPLDQSNEDSASK,ph,S,478,true,"atm and atr DNA damage response",88,25561503,"MASCOT Score",60.0000000,0.9580000,,,,,0.1900000
TPLDQSNEDSASK,ph,S,478,true,"TOR Kinase and ABA Receptor",100,29290610,XCorr,3.6466479,0.9057000,,,,0.0012619999470189,
TPLDQSNEDSASK,ph,S,478,true,"Tissue atlas Arabidopsis - ProteomicsDB",114,32188942,"MaxQuant score",245.9600000,0.9989750,,,,0,
TPLDQSNEDSASKSTSNQEK,ph,S,482,true,"Tissue atlas Arabidopsis - ProteomicsDB",114,32188942,"MaxQuant score",160.9100000,0.8141930,,,,1.5571999736416E-29,
TPLDQSNEDSASKSTSNQEK,ph,S,484,true,"Tissue atlas Arabidopsis - ProteomicsDB",114,32188942,"MaxQuant score",98.9240000,0.8162290,,,,1.4185999930305E-8,
SPMADTNYHMNPNHNGDLEGVTGMQGSPKR,ph,S,515,true,"Tissue atlas Arabidopsis - ProteomicsDB",114,32188942,"MaxQuant score",328.9100000,1.0000000,,,,0,
SPMADTNYHMNPNHNGDLEGVTGMQGSPK,ph,S,515,true,"atm and atr DNA damage response",88,25561503,"MASCOT Score",33.0000000,1.0000000,,,,,0.3300000
SPMADTNYHMNPNHNGDLEGVTGMQGSPK,ph,S,515,true,"Phospho cell culture sucrose/TOR",109,30833711,,,0.9970890,,,,,
TSDETMMQPINADFSSNEK,ph,S,535,true,"Tissue atlas Arabidopsis - ProteomicsDB",114,32188942,"MaxQuant score",43.9460000,0.7572680,,,,0.0023881399538368,
FDVVSDQELMAQR,ph,S,578,true,"Tissue atlas Arabidopsis - ProteomicsDB",114,32188942,"MaxQuant score",142.1000000,1.0000000,,,,3.0493199574266E-6,
