Peptide,PTM,ModifiedAA,ModifiedPosition,PeptideUniqueToGene,ExperimentDesc,ExpID,PubmedID,ScoreType,IdentScore,LocProb,Log2FChange,PQ-val,QuantSig,PEP,MassErrorPPM
LANLLFLESPAGVGFSYSNTTSDLYTAGDQR,ng,N,138,true,"Conserved N-glycosylation",74,22633491,"MaxQuant Score",225.3900000,1.0000000,,,,0,-1.2810000
SYAGHYVPQLSQIVYE,nt,S,180,true,"N-terminal ChaFRADIC",92,26010716,"MASCOT Score",26.3100000,,,,,0.00047329999506474,
ITCEFGSSEHPSSK,sno,C,244,true,"hot5-4 / wildtype, FAT-switch S-nitrosoproteome",169,37277371,,,,0.2955725,0.0025453,NO,,
AYDPCTEK,sno,C,306,true,"hot5-4 / wildtype, FAT-switch S-nitrosoproteome",169,37277371,,,,0.4916655,0.0086751,NO,,
AMHANITGLAYPWKGCSDIVGEK,ng,N,327,true,"Conserved N-glycosylation",74,22633491,"MaxQuant Score",138.8400000,1.0000000,,,,9.9020001058179E-20,0.0330000
AMHANITGLAYPWKGCSDIVGEK,ng,N,327,true,"N-Glycopeptide Profiling in Arabidopsis Infloresce",132,27067053,"MOWSE score",32.4000000,,,,,0.0013999999500811,
AMHANITGLAYPWK,ng,N,327,true,"N-Glycopeptide Profiling in Arabidopsis Infloresce",132,27067053,"MOWSE score",20.6000000,,,,,0.028999999165535,
AMHANITGLAYPWK,ng,N,327,true,"N-linked Glycan Micro-heterogeneity Arabidopsis",134,29237727,,,,,,,,
AMHANITGLAYPWK,ng,N,327,true,"UDP-GlcNAc transporter glycopeptide analysis",135,30224661,,,,,,,1.3007066525399E-15,0.8000000
GCSDIVGEK,ox,C,338,true,"OxiTRAQ Arabidopsis - 5 mM H2O2 versus control",47,24376095,,,,-0.1765593,0.0300625,NO,,
GCSDIVGEK,sno,C,338,true,"hot5-4 / wildtype, FAT-switch S-nitrosoproteome",169,37277371,,,,0.0922253,0.3950151,NO,,
