Peptide,PTM,ModifiedAA,ModifiedPosition,PeptideUniqueToGene,ExperimentDesc,ExpID,PubmedID,ScoreType,IdentScore,LocProb,Log2FChange,PQ-val,QuantSig,PEP,MassErrorPPM
EKLPIKR,ac,K,147,false,"Quantitative Acetylproteomics",101,29440448,,,,,,,,
SRGSLGSLNMITGK,ph,S,149,true,"atm and atr DNA damage response",88,25561503,"MASCOT Score",42.0000000,1.0000000,,,,,-0.4100000
SRGSLGSLNMITGK,ph,S,149,true,"Tissue atlas Arabidopsis - ProteomicsDB",114,32188942,"MaxQuant score",144.1700000,0.9969400,,,,1.7083800685214E-7,
RSRGSLGSLNMITGK,ph,S,152,true,"srk2dei ABA signaling phopshoproteomics",83,23572148,"MASCOT Score",26.0000000,,,,,,-0.0009000
RSRGSLGSLNMITGK,ph,S,152,true,"TOR Kinase and ABA Receptor",100,29290610,XCorr,2.3152828,0.7879000,,,,0.001306000049226,
SRGSLGSLNMITGK,ph,S,152,true,"Phosphoproteome iron-deficient Arabidopsis roots",41,22438062,"MASCOT Score",38.8000000,,,,,,
SRGSLGSLNMITGK,ph,S,152,true,"Large-scale phosphorylation discovery",44,23111157,XCorr,2.9900000,,,,,,
SRGSLGSLNMITGK,ph,S,152,true,"PAMP-triggered phosphorylation",48,24601666,"MASCOT Score",38.7400000,,,,,,
SRGSLGSLNMITGK,ph,S,152,true,"LAXIC - mannitol vs control",84b,23660473,XCorr,3.1500000,0.9930000,,,,0.00072460400406271,
SRGSLGSLNMITGK,ph,S,152,true,"SnRK2 protein kinase substrates",85,23776212,XCorr,3.2559557,1.0000000,,,,2.5271900525492E-14,
SRGSLGSLNMITGK,ph,S,152,true,"atm and atr DNA damage response",88,25561503,"MASCOT Score",59.0000000,1.0000000,,,,,0.9100000
SRGSLGSLNMITGK,ph,S,152,true,"TOR Kinase and ABA Receptor",100,29290610,XCorr,4.6238947,0.9986000,,,,3.6230001569493E-5,
SRGSLGSLNMITGK,ph,S,152,true,"Col-0 callus - FC Col-0 vs. Col-0 Xray",111a,31410901,,61.1800000,,0.1130505,0.0000000,NO,,0.6287408
SRGSLGSLNMITGK,ph,S,152,true,"Col-0 X-ray callus - FC Col-0 vs. Col-0 Xray",111b,31410901,,61.1800000,,0.1130505,0.0000000,NO,,0.6287408
SRGSLGSLNMITGK,ph,S,152,true,"atm callus - FC atm vs. atm Xray",111c,31410901,,61.1800000,,1.1859354,0.0000000,NO,,0.6287408
SRGSLGSLNMITGK,ph,S,152,true,"atm-3 X-ray callus - FC atm vs. atm Xray",111d,31410901,,61.1800000,,1.1859354,0.0000000,NO,,0.6287408
GSLGSLNMITGK,ph,S,152,true,"srk2dei ABA signaling phopshoproteomics",83,23572148,"MASCOT Score",79.0000000,,,,,,0.0000000
GSLGSLNMITGK,ph,S,152,true,"atm and atr DNA damage response",88,25561503,"MASCOT Score",88.0000000,1.0000000,,,,,-0.3700000
GSLGSLNMITGK,ph,S,152,true,"TOR Kinase and ABA Receptor",100,29290610,XCorr,3.2143703,0.9584000,,,,0.0014870000304654,
GSLGSLNMITGK,ph,S,152,true,"Phospho cell culture sucrose/TOR",109,30833711,,,0.9950160,,,,,
GSLGSLNMITGK,ph,S,152,true,"Col-0 callus - FC Col-0 vs. Col-0 Xray",111a,31410901,,76.6500000,,0.4808676,0.0000000,NO,,0.6343951
GSLGSLNMITGK,ph,S,152,true,"Col-0 X-ray callus - FC Col-0 vs. Col-0 Xray",111b,31410901,,76.6500000,,0.4808676,0.0000000,NO,,0.6343951
GSLGSLNMITGK,ph,S,152,true,"atm callus - FC atm vs. atm Xray",111c,31410901,,76.6500000,,0.7846442,0.0000000,NO,,0.6343951
GSLGSLNMITGK,ph,S,152,true,"atm-3 X-ray callus - FC atm vs. atm Xray",111d,31410901,,76.6500000,,0.7846442,0.0000000,NO,,0.6343951
GSLGSLNMITGK,ph,S,152,true,"Tissue atlas Arabidopsis - ProteomicsDB",114,32188942,"MaxQuant score",233.5700000,1.0000000,,,,0,
RSRGSLGSLNMITGK,ph,S,155,true,"srk2dei ABA signaling phopshoproteomics",83,23572148,"MASCOT Score",26.0000000,,,,,,-0.0009000
RSRGSLGSLNMITGK,ph,S,155,true,"TOR Kinase and ABA Receptor",100,29290610,XCorr,2.3152828,0.7588000,,,,0.001306000049226,
SRGSLGSLNMITGK,ph,S,155,true,"LAXIC - mannitol vs control",84b,23660473,XCorr,3.1500000,0.9920000,,,,0.00072460400406271,
SRGSLGSLNMITGK,ph,S,155,true,"SnRK2 protein kinase substrates",85,23776212,XCorr,3.2340896,1.0000000,,,,1.6278100645195E-7,
SRGSLGSLNMITGK,ph,S,155,true,"atm and atr DNA damage response",88,25561503,"MASCOT Score",43.0000000,1.0000000,,,,,-1.7200000
SRGSLGSLNMITGK,ph,S,155,true,"Phospho cell culture sucrose/TOR",109,30833711,,,0.9986470,,,,,
SRGSLGSLNMITGK,ph,S,155,true,"Col-0 callus - FC Col-0 vs. Col-0 Xray",111a,31410901,,48.0000000,,0.5217146,0.0000000,NO,,0.8444753
SRGSLGSLNMITGK,ph,S,155,true,"Col-0 X-ray callus - FC Col-0 vs. Col-0 Xray",111b,31410901,,48.0000000,,0.5217146,0.0000000,NO,,0.8444753
SRGSLGSLNMITGK,ph,S,155,true,"atm callus - FC atm vs. atm Xray",111c,31410901,,48.0000000,,0.9979304,0.0000000,NO,,0.8444753
SRGSLGSLNMITGK,ph,S,155,true,"atm-3 X-ray callus - FC atm vs. atm Xray",111d,31410901,,48.0000000,,0.9979304,0.0000000,NO,,0.8444753
GSLGSLNMITGK,ph,S,155,true,"srk2dei ABA signaling phopshoproteomics",83,23572148,"MASCOT Score",74.0000000,,,,,,-0.0006000
GSLGSLNMITGK,ph,S,155,true,"atm and atr DNA damage response",88,25561503,"MASCOT Score",66.0000000,1.0000000,,,,,-0.3900000
GSLGSLNMITGK,ph,S,155,true,"Lateral root-induction - NAA vs control",106,23328941,"MASCOT Score",35.0000000,,,,,,
GSLGSLNMITGK,ph,S,155,true,"Tissue atlas Arabidopsis - ProteomicsDB",114,32188942,"MaxQuant score",224.7500000,1.0000000,,,,1.4349016014993E-40,
GSLGSLNMITGK,ph,T,160,true,"Lateral root-induction - NAA vs control",106,23328941,"MASCOT Score",37.0000000,,,,,,
VSTPVPGVVAPGSR,ph,T,280,true,"Col-0 callus - FC Col-0 vs. Col-0 Xray",111a,31410901,,33.7900000,,-0.6523291,0.0000000,NO,,0.4285908
VSTPVPGVVAPGSR,ph,T,280,true,"Col-0 X-ray callus - FC Col-0 vs. Col-0 Xray",111b,31410901,,33.7900000,,-0.6523291,0.0000000,NO,,0.4285908
VSTPVPGVVAPGSR,ph,T,280,true,"atm callus - FC atm vs. atm Xray",111c,31410901,,33.7900000,,0.0666403,0.0000000,NO,,0.4285908
VSTPVPGVVAPGSR,ph,T,280,true,"atm-3 X-ray callus - FC atm vs. atm Xray",111d,31410901,,33.7900000,,0.0666403,0.0000000,NO,,0.4285908
VSTPVPGVVAPGSR,ph,T,280,true,"Tissue atlas Arabidopsis - ProteomicsDB",114,32188942,"MaxQuant score",156.3100000,0.9624960,,,,6.2304800207968E-10,
VSTPVPGVVAPGSR,ph,S,290,true,"Tissue atlas Arabidopsis - ProteomicsDB",114,32188942,"MaxQuant score",142.4000000,1.0000000,,,,6.2637898286843E-29,
DGGHSQPWLQDDR,ph,S,296,true,"Tissue atlas Arabidopsis - ProteomicsDB",114,32188942,"MaxQuant score",105.8900000,1.0000000,,,,0.00016619100642856,
KQAECDELAQR,ub,K,326,false,"Arabidopsis ubiquitination COFRADIC",40,26744219,"MaxQuant Score",60.2550000,1.0000000,,,,0.0005158000276424,0.2010000
QAECDELAQR,ox,C,330,false,"OxiTRAQ Arabidopsis - 5 mM H2O2 versus control",47,24376095,,,,2.5665070,0.0008223,YES,,
KVDSYKDST,ph,S,404,true,"Tissue atlas Arabidopsis - ProteomicsDB",114,32188942,"MaxQuant score",99.8440000,0.9999920,,,,0.0072083701379597,
KVDSYKDST,ub,K,406,true,"Arabidopsis ubiquitination COFRADIC",40,26744219,"MaxQuant Score",108.4700000,1.0000000,,,,0.00092369999038056,0.1780000
KVDSYKDST,ph,S,408,true,"atm and atr DNA damage response",88,25561503,"MASCOT Score",25.0000000,0.8990000,,,,,-2.2300000
