Peptide,PTM,ModifiedAA,ModifiedPosition,PeptideUniqueToGene,ExperimentDesc,ExpID,PubmedID,ScoreType,IdentScore,LocProb,Log2FChange,PQ-val,QuantSig,PEP,MassErrorPPM
SAVSTSTIDYEFTDGGKEVELR,nt,S,71,true,"Stromal N-terminome",96,26371235,"MASCOT Score",74.0100000,,,,,,
SAVSTSTIDYEFTDGGKEVELR,nt,S,71,true,"HUNTER N-terminome: legumain, GluC and trypsin",119,31951383,"MaxQuant score",114.7200000,,,,,,
SAVSTSTIDYEFTDGGKEVELR,nt,S,71,true,"Arabidopsis translation initiation landscape - NT",167b,35069635,,,,,,,,
SAVSTSTIDYEFTD,nt,S,71,true,"HUNTER N-terminome: legumain, GluC and trypsin",119,31951383,"MaxQuant score",109.6600000,,,,,,
SAVSTSTIDYE,nt,S,71,true,"N-terminal ChaFRADIC",92,26010716,"MASCOT Score",47.3600000,,,,,5.832000169903E-5,
SAVSTSTIDYE,nt,S,71,true,"Arg/N-end rule seed, prt6 vs. Wt",99,29168982,"MASCOT Score",69.9900000,,0.3332540,0.0317019,NO,5.8480000006966E-6,-0.9248287
SAVSTSTIDYE,nt,S,71,true,"HUNTER N-terminome: legumain, GluC and trypsin",119,31951383,"MaxQuant score",144.3800000,,,,,,
AVSTSTIDYE,nt,A,72,true,"N-terminal ChaFRADIC",92,26010716,"MASCOT Score",50.1100000,,,,,0.0010900000343099,
AVSTSTIDYE,nt,A,72,true,"Arg/N-end rule seed, prt6 vs. Wt",99,29168982,"MASCOT Score",74.7000000,,-0.0012876,0.9970327,NO,4.5609998778673E-5,-1.5069820
