Peptide,PTM,ModifiedAA,ModifiedPosition,PeptideUniqueToGene,ExperimentDesc,ExpID,PubmedID,ScoreType,IdentScore,LocProb,Log2FChange,PQ-val,QuantSig,PEP,MassErrorPPM
VKMAAFAGSDSETTSSTSR,nt,V,43,true,"Arabidopsis translation initiation landscape - NT",167b,35069635,,,,,,,,
AAFAGSDSETTSSTSR,nt,A,46,true,"Stromal N-terminome",96,26371235,"MASCOT Score",81.8900000,,,,,,
AAFAGSDSE,nt,A,46,true,"Arg/N-end rule seed, prt6 vs. Wt",99,29168982,"MASCOT Score",41.7800000,,-0.2924205,0.1198916,NO,0.0050559998489916,-2.7802713
AAFAGSDSETTSSTSRVI,nta,A,46,true,"Arabidopsis translation initiation landscape - NTA",167a,35069635,,,,,,,,
AAFAGSDSETTSSTSR,nta,A,46,true,"Characterization plant N-terminal acetylation",6,22223895,"MASCOT Score",85.8300000,,,,,,
AAFAGSDSETTSSTSR,nta,A,46,true,"Stromal N-terminome",96,26371235,"MASCOT Score",81.8900000,,,,,,
AAFAGSDSETTSSTSR,nta,A,46,true,"FtsH12 N-terminome: WT / FtsH12 knockdown miRNA",118,33216923,"MaxQuant score",143.0100000,,,,,0.00022072000137996,
AFAGSDSETTSSTSR,nt,A,47,true,"Tic56 chloroplast import - tic56-1",89c,25588737,XCorr,3.6351109,,,,,,
AFAGSDSETTSSTSR,nt,A,47,true,"Stromal N-terminome",96,26371235,"MASCOT Score",51.8200000,,,,,,
AFAGSDSETTSSTSR,nt,A,47,true,"Arg/N-end rule seed, prt6 vs. Wt",99,29168982,"MASCOT Score",103.3000000,,,,,0.00024510000366718,-1.1632019
AFAGSDSE,nt,A,47,true,"Arg/N-end rule seed, prt6 vs. Wt",99,29168982,"MASCOT Score",34.5200000,,-0.1328532,0.3760398,NO,0.031550001353025,0.1698743
AFAGSDSETTSSTSRVI,nta,A,47,true,"Arabidopsis translation initiation landscape - NTA",167a,35069635,,,,,,,,
AFAGSDSETTSSTSR,nta,A,47,true,"Characterization plant N-terminal acetylation",6,22223895,"MASCOT Score",84.0300000,,,,,,
AFAGSDSETTSSTSR,nta,A,47,true,"Stromal N-terminome",96,26371235,"MASCOT Score",51.8200000,,,,,,
AFAGSDSETTSSTSR,nta,A,47,true,"Arg/N-end rule seed, prt6 vs. Wt",99,29168982,"MASCOT Score",103.3000000,,,,,0.00024510000366718,-1.1632019
MAAFAGSDSETTSSTSR,ph,S,51,true,"Phospho cell culture sucrose/TOR",109,30833711,,,0.9199980,,,,,
FDHSLVTSVLKR,ac,K,128,true,"Quantitative Acetylproteomics",101,29440448,,,,,,,,
TTVLLDHAGFCK,ox,C,231,true,"SPEAR - 50 mM H2O2 / mock",138b,34619326,,,,-2.4739429,0.0104929,YES,,
TTVLLDHAGFCK,sno,C,231,true,"Site-specific nitrosomeproteomic id - gsnor1-3",90a,25699590,XCorr,3.3477941,,,,,5.3610001486959E-6,-6.2127766
TTVLLDHAGFCK,sno,C,231,true,"Site-specific nitrosomeproteomic id - gsnor1-3",90b,25699590,XCorr,3.7700000,,,,,0.044629998505116,-6.9800000
TTVLLDHAGFCK,so,C,231,true,"Arabidopsis S-sulfenylation chemoproteomics",108,31578252,"pFind PSM Score",0.0000189,,1.1098200,,,,0.0719759
