Peptide,PTM,ModifiedAA,ModifiedPosition,PeptideUniqueToGene,ExperimentDesc,ExpID,PubmedID,ScoreType,IdentScore,LocProb,Log2FChange,PQ-val,QuantSig,PEP,MassErrorPPM
VWAINSDGAESPSKK,ph,S,49,true,"Tissue atlas Arabidopsis - ProteomicsDB",114,32188942,"MaxQuant score",169.2500000,1.0000000,,,,6.8217800184207E-18,
VWAINSDGAESPSKK,ph,S,54,true,"Tissue atlas Arabidopsis - ProteomicsDB",114,32188942,"MaxQuant score",300.5600000,0.9993040,,,,0,
VWAINSDGAESPSK,ph,S,54,true,"Lateral root-induction - NAA vs control",106,23328941,"MASCOT Score",42.0000000,,,,,,
VWAINSDGAESPSK,ph,S,54,true,"Phospho cell culture sucrose/TOR",109,30833711,,,0.8643050,,,,,
VWAINSDGAESPSKK,ph,S,56,true,"Large-scale phosphorylation discovery",44,23111157,XCorr,4.4450000,,,,,,
GNVAQTLKSPNWK,ph,S,141,true,"Tissue atlas Arabidopsis - ProteomicsDB",114,32188942,"MaxQuant score",272.3800000,1.0000000,,,,0,
GQVDTVTSLVSPGVSSQR,ph,S,209,true,"Phospho cell culture sucrose/TOR",109,30833711,,,0.8049950,,,,,
GQVDTVTSLVSPGVSSQR,ph,S,209,true,"Tissue atlas Arabidopsis - ProteomicsDB",114,32188942,"MaxQuant score",311.5400000,0.9999850,,,,0,
TSSAVTQKPNGVR,ph,S,219,true,"Tissue atlas Arabidopsis - ProteomicsDB",114,32188942,"MaxQuant score",75.9110000,0.9708390,,,,0.00037133801379241,
