Peptide,PTM,ModifiedAA,ModifiedPosition,PeptideUniqueToGene,ExperimentDesc,ExpID,PubmedID,ScoreType,IdentScore,LocProb,Log2FChange,PQ-val,QuantSig,PEP,MassErrorPPM
STVLEGLKYAN,nt,S,35,true,"HUNTER N-terminome: legumain, GluC and trypsin",119,31951383,"MaxQuant score",230.2400000,,,,,,
AHAQDHLGE,nt,A,63,true,"N-terminal ChaFRADIC",92,26010716,"MASCOT Score",22.8200000,,,,,0.025319999083877,
SFGAVESVKATSEILSPISGEIIEVNKK,lip,K,97,true,"Open search Plant PTM Viewer 2.0 - Lipoylation",164d,TBA,,,,,,,,
SPISGEIIEVN,nt,S,104,true,"N-terminal ChaFRADIC",92,26010716,"MASCOT Score",64.9900000,,,,,0.0015999999595806,
SPGLINSSPYE,nt,S,120,false,"Arg/N-end rule seed, prt6 vs. Wt",99,29168982,"MASCOT Score",52.6400000,,-0.1978020,0.3530751,NO,0.00015769999299664,-3.2361992
LTESPGLINSSPYEDGWMIK,ph,S,120,false,"Tissue atlas Arabidopsis - ProteomicsDB",114,32188942,"MaxQuant score",122.2200000,0.9191680,,,,2.4815600356326E-17,
VKPSSPAELESLMGPK,ph,S,140,true,"srk2dei ABA signaling phopshoproteomics",83,23572148,"MASCOT Score",45.0000000,,,,,,0.0010000
VKPSSPAELESLMGPK,ph,S,141,true,"srk2dei ABA signaling phopshoproteomics",83,23572148,"MASCOT Score",59.0000000,,,,,,0.0002000
VKPSSPAELESLMGPK,ph,S,141,true,"Tissue atlas Arabidopsis - ProteomicsDB",114,32188942,"MaxQuant score",134.3400000,0.9895670,,,,9.5092801188912E-8,
VKPSSPAELESLMGPK,mox,M,149,true,"cat2 Methionine oxidation - 1h stress",62a,25693801,"MASCOT Score",81.0000000,,0.0638999,,NO,,
VKPSSPAELESLMGPK,mox,M,149,true,"cat2 Methionine oxidation - 3h stress",62b,25693801,"MASCOT Score",67.0000000,,-0.0566815,,NO,,
EYTKFCEEEDAAH,ac,K,156,false,"Histone deacetylases substrates - hda14 vs WT",98e,29061669,"MaxQuant Score",46.1000000,1.0000000,0.0550000,0.9289664,NO,0.003000000026077,
EYTKFCEEEDAAH,acy,C,158,false,"Arabidopsis S-acylation atlas - Silique",163e,35681017,,,,,,,,
FCEEEDAAH,ox,C,158,false,"OxiTRAQ Arabidopsis - 5 mM H2O2 versus control",47,24376095,,,,-0.1710413,0.1492142,NO,,
