Peptide,PTM,ModifiedAA,ModifiedPosition,PeptideUniqueToGene,ExperimentDesc,ExpID,PubmedID,ScoreType,IdentScore,LocProb,Log2FChange,PQ-val,QuantSig,PEP,MassErrorPPM
SPLHQSTFAASTSNGAAPR,ph,S,22,true,"Tissue atlas Arabidopsis - ProteomicsDB",114,32188942,"MaxQuant score",112.7400000,0.9999990,,,,2.9650198962727E-10,
SIVQQLTGSPSR,ph,S,65,true,"Col-0 callus - FC Col-0 vs. Col-0 Xray",111a,31410901,,62.3300000,,-0.1160807,0.0000000,NO,,0.5153559
SIVQQLTGSPSR,ph,S,65,true,"Col-0 X-ray callus - FC Col-0 vs. Col-0 Xray",111b,31410901,,62.3300000,,-0.1160807,0.0000000,NO,,0.5153559
SIVQQLTGSPSR,ph,S,65,true,"atm callus - FC atm vs. atm Xray",111c,31410901,,62.3300000,,-0.0126373,0.0000000,NO,,0.5153559
SIVQQLTGSPSR,ph,S,65,true,"atm-3 X-ray callus - FC atm vs. atm Xray",111d,31410901,,62.3300000,,-0.0126373,0.0000000,NO,,0.5153559
SIVQQLTGSPSR,ph,S,65,true,"Tissue atlas Arabidopsis - ProteomicsDB",114,32188942,"MaxQuant score",246.8600000,0.9922970,,,,0,
DQFWSNTAESPVSEYMR,ph,S,149,true,"Phospho cell culture sucrose/TOR",109,30833711,,,0.9867020,,,,,
DQFWSNTAESPVSEYMR,ph,S,149,true,"Tissue atlas Arabidopsis - ProteomicsDB",114,32188942,"MaxQuant score",470.7100000,0.9999980,,,,0,
