Peptide,PTM,ModifiedAA,ModifiedPosition,PeptideUniqueToGene,ExperimentDesc,ExpID,PubmedID,ScoreType,IdentScore,LocProb,Log2FChange,PQ-val,QuantSig,PEP,MassErrorPPM
QYYPSQDESMSPTSVR,ph,S,10,true,"Lateral root-induction - NAA vs control",106,23328941,"MASCOT Score",28.0000000,,,,,,
QYYPSQDESMSPTSVR,ph,S,14,true,"Lateral root-induction - NAA vs control",106,23328941,"MASCOT Score",29.0000000,,,,,,
QYYPSQDESMSPTSVR,ph,S,14,true,"Tissue atlas Arabidopsis - ProteomicsDB",114,32188942,"MaxQuant score",78.6920000,0.8607660,,,,0.00010294000094291,
QYYPSQDESMSPTSVR,ph,S,16,true,"Large-scale phosphorylation discovery",44,23111157,XCorr,3.8680000,,,,,,
QYYPSQDESMSPTSVR,ph,S,16,true,"Conserved plant phosphoproteome - Arabidopsis",61a,20466843,"MASCOT Score",44.0000000,1.0000000,,,,,
QYYPSQDESMSPTSVR,ph,S,16,true,"srk2dei ABA signaling phopshoproteomics",83,23572148,"MASCOT Score",27.0000000,,,,,,0.0014000
QYYPSQDESMSPTSVR,ph,S,16,true,"LAXIC - ABA stress",84a,23660473,XCorr,3.0500000,0.8400000,,,,1.0499999916647E-5,
QYYPSQDESMSPTSVR,ph,S,16,true,"SnRK2 protein kinase substrates",85,23776212,XCorr,3.5040982,0.9880000,,,,2.7618700187304E-5,
QYYPSQDESMSPTSVR,ph,S,16,true,"atm and atr DNA damage response",88,25561503,"MASCOT Score",40.0000000,0.9990000,,,,,0.0700000
QYYPSQDESMSPTSVR,ph,S,16,true,"TOR Kinase and ABA Receptor",100,29290610,XCorr,4.7454953,0.9882000,,,,7.1599998818783E-8,
QYYPSQDESMSPTSVR,ph,S,16,true,"Lateral root-induction - NAA vs control",106,23328941,"MASCOT Score",35.0000000,,,,,,
QYYPSQDESMSPTSVR,ph,S,16,true,"Phospho cell culture sucrose/TOR",109,30833711,,,0.9911440,,,,,
QYYPSQDESMSPTSVR,ph,S,16,true,"Tissue atlas Arabidopsis - ProteomicsDB",114,32188942,"MaxQuant score",316.6800000,0.9997060,,,,0,
QYYPSQDESMSPTSVR,ph,S,19,true,"Conserved plant phosphoproteome - Arabidopsis",61a,20466843,"MASCOT Score",44.0000000,1.0000000,,,,,
STVITLLPHQN,nt,S,180,true,"HUNTER N-terminome: legumain, GluC and trypsin",119,31951383,"MaxQuant score",132.9000000,,,,,,
ISAPSVKSPR,ph,S,786,true,"srk2dei ABA signaling phopshoproteomics",83,23572148,"MASCOT Score",25.0000000,,,,,,-0.0005000
ISAPSVKSPR,ph,S,789,true,"atm and atr DNA damage response",88,25561503,"MASCOT Score",43.0000000,1.0000000,,,,,-1.1400000
ISAPSVKSPR,ph,S,789,true,"Phospho cell culture sucrose/TOR",109,30833711,,,0.9908000,,,,,
ISAPSVKSPR,ph,S,789,true,"Tissue atlas Arabidopsis - ProteomicsDB",114,32188942,"MaxQuant score",155.6600000,0.9999950,,,,1.5354099787146E-6,
SIYTQYYSNTPSTPLSTASPYHSPSVSLIHASPSMK,ph,S,1305,true,"Tissue atlas Arabidopsis - ProteomicsDB",114,32188942,"MaxQuant score",267.3600000,0.9913430,,,,0,
SIYTQYYSNTPSTPLSTASPYHSPSVSLIHASPSMK,ph,Y,1307,true,"TOR Kinase and ABA Receptor",100,29290610,XCorr,4.7292776,0.8396000,,,,6.6060001699952E-6,
SIYTQYYSNTPSTPLSTASPYHSPSVSLIHASPSMK,ph,S,1309,true,"Tissue atlas Arabidopsis - ProteomicsDB",114,32188942,"MaxQuant score",227.3500000,0.8403270,,,,0,
SIYTQYYSNTPSTPLSTASPYHSPSVSLIHASPSMK,ph,S,1320,true,"TOR Kinase and ABA Receptor",100,29290610,XCorr,4.1600962,0.8049000,,,,0.015699999406934,
SIYTQYYSNTPSTPLSTASPYHSPSVSLIHASPSMK,ph,S,1320,true,"Tissue atlas Arabidopsis - ProteomicsDB",114,32188942,"MaxQuant score",214.7500000,0.7749750,,,,0,
GSGSGSSSTAAPDSGYFK,ph,S,1331,true,"atm and atr DNA damage response",88,25561503,"MASCOT Score",39.0000000,0.9210000,,,,,0.8000000
GSGSGSSSTAAPDSGYFK,ph,S,1331,true,"Tissue atlas Arabidopsis - ProteomicsDB",114,32188942,"MaxQuant score",177.6200000,0.8220780,,,,2.7408100068345E-35,
GSGSGSSSTAAPDSGYFK,ph,S,1333,true,"Tissue atlas Arabidopsis - ProteomicsDB",114,32188942,"MaxQuant score",196.4500000,0.9489760,,,,2.8025969286496E-45,
GSGSGSSSTAAPDSGYFK,ph,S,1336,true,"Tissue atlas Arabidopsis - ProteomicsDB",114,32188942,"MaxQuant score",73.9530000,0.8842520,,,,7.1967297117226E-5,
GSSSSLYGQEHYTESETGNSR,ph,S,1349,true,"atm and atr DNA damage response",88,25561503,"MASCOT Score",56.0000000,0.9950000,,,,,0.2000000
SGPLDYSSSHK,ph,S,1385,true,"atm and atr DNA damage response",88,25561503,"MASCOT Score",41.0000000,1.0000000,,,,,-1.0000000
SGPLDYSSSHK,ph,S,1385,true,"Phospho cell culture sucrose/TOR",109,30833711,,,1.0000000,,,,,
SGPLDYSSSHK,ph,S,1385,true,"Tissue atlas Arabidopsis - ProteomicsDB",114,32188942,"MaxQuant score",155.9900000,1.0000000,,,,1.847910019448E-10,
RSGPLDYSSSHK,ph,S,1392,true,"TOR Kinase and ABA Receptor",100,29290610,XCorr,2.8832409,0.8881000,,,,0.0012329999590293,
SGPLDYSSSHK,ph,S,1392,true,"Tissue atlas Arabidopsis - ProteomicsDB",114,32188942,"MaxQuant score",148.3100000,0.8769770,,,,0,
SGPLDYSSSHKGGSGSNSTGPSPLPR,ph,S,1393,true,"atm and atr DNA damage response",88,25561503,"MASCOT Score",61.0000000,1.0000000,,,,,-0.8900000
SGPLDYSSSHKGGSGSNSTGPSPLPR,ph,S,1393,true,"Tissue atlas Arabidopsis - ProteomicsDB",114,32188942,"MaxQuant score",229.1600000,0.9639330,,,,0,
SGPLDYSSSHK,ph,S,1393,true,"atm and atr DNA damage response",88,25561503,"MASCOT Score",40.0000000,0.9970000,,,,,0.5700000
GGSGSNSTGPSPLPR,ph,S,1398,true,"Tissue atlas Arabidopsis - ProteomicsDB",114,32188942,"MaxQuant score",165.5700000,0.9971110,,,,1.3549599810203E-13,
GGSGSNSTGPSPLPR,ph,S,1400,true,"Tissue atlas Arabidopsis - ProteomicsDB",114,32188942,"MaxQuant score",77.4390000,0.9022120,,,,1.5969199573806E-10,
GGSGSNSTGPSPLPR,ph,S,1402,true,"atm and atr DNA damage response",88,25561503,"MASCOT Score",66.0000000,0.9150000,,,,,-0.6200000
GGSGSNSTGPSPLPR,ph,S,1402,true,"Tissue atlas Arabidopsis - ProteomicsDB",114,32188942,"MaxQuant score",230.9600000,0.9991740,,,,0,
GGSGSNSTGPSPLPR,ph,T,1403,true,"atm and atr DNA damage response",88,25561503,"MASCOT Score",30.0000000,0.9910000,,,,,-1.0700000
GGSGSNSTGPSPLPR,ph,S,1406,true,"atm and atr DNA damage response",88,25561503,"MASCOT Score",66.0000000,1.0000000,,,,,-0.6200000
GGSGSNSTGPSPLPR,ph,S,1406,true,"Tissue atlas Arabidopsis - ProteomicsDB",114,32188942,"MaxQuant score",145.3300000,0.9999970,,,,3.2750699374695E-10,
SGPISYK,ph,S,1416,true,"Phospho cell culture sucrose/TOR",109,30833711,,,0.9999860,,,,,
SGPISYK,ph,S,1416,true,"Tissue atlas Arabidopsis - ProteomicsDB",114,32188942,"MaxQuant score",88.3700000,0.9999940,,,,0.018679900094867,
