Peptide,PTM,ModifiedAA,ModifiedPosition,PeptideUniqueToGene,ExperimentDesc,ExpID,PubmedID,ScoreType,IdentScore,LocProb,Log2FChange,PQ-val,QuantSig,PEP,MassErrorPPM
MDQAKGYEHVRY,nta,M,1,true,"Arabidopsis translation initiation landscape - NTA",167a,35069635,,,,,,,,
MDQAKGYEHVR,nta,M,1,true,"Arg/N-end rule seed, prt6 vs. Wt",99,29168982,"MASCOT Score",29.0500000,,-0.2578428,0.0532947,NO,0.015089999884367,0.1831975
MDQAKGYEH,nta,M,1,true,"Arg/N-end rule seed, prt6 vs. Wt",99,29168982,"MASCOT Score",32.4300000,,-0.1376601,0.0906527,NO,0.047690000385046,-1.6047166
GYEHVRYTAPDPR,me2,R,11,true,"Arabidopsis protein methylome",123,31809900,"MaxQuant Score",80.6900000,1.0000000,,,,1.7208400322488E-6,0.2343100
DEGLGSINQR,ph,S,24,true,"srk2dei ABA signaling phopshoproteomics",83,23572148,"MASCOT Score",42.0000000,,,,,,0.0004000
DEGLGSINQR,ph,S,24,true,"atm and atr DNA damage response",88,25561503,"MASCOT Score",45.0000000,1.0000000,,,,,0.9000000
DEGLGSINQR,ph,S,24,true,"Tissue atlas Arabidopsis - ProteomicsDB",114,32188942,"MaxQuant score",124.1200000,1.0000000,,,,0.00010178299999097,
RQSFEHER,ph,S,125,true,"atm and atr DNA damage response",88,25561503,"MASCOT Score",41.0000000,1.0000000,,,,,0.2800000
RQSFEHER,ph,S,125,true,"TOR Kinase and ABA Receptor",100,29290610,XCorr,2.0504987,1.0000000,,,,0.0046190000139177,
RQSFEHER,ph,S,125,true,"Col-0 callus - FC Col-0 vs. Col-0 Xray",111a,31410901,,56.0800000,,-3.4296032,0.0000000,NO,,0.3085470
RQSFEHER,ph,S,125,true,"Col-0 X-ray callus - FC Col-0 vs. Col-0 Xray",111b,31410901,,56.0800000,,-3.4296032,0.0000000,NO,,0.3085470
RQSFEHER,ph,S,125,true,"atm callus - FC atm vs. atm Xray",111c,31410901,,56.0800000,,6.1487182,0.0000000,NO,,0.3085470
RQSFEHER,ph,S,125,true,"atm-3 X-ray callus - FC atm vs. atm Xray",111d,31410901,,56.0800000,,6.1487182,0.0000000,NO,,0.3085470
RQSFEHER,ph,S,125,true,"Tissue atlas Arabidopsis - ProteomicsDB",114,32188942,"MaxQuant score",110.0800000,1.0000000,,,,0.00072787498356774,
TYHELVQSAPVISSK,ph,S,147,true,"Large-scale phosphorylation discovery",44,23111157,XCorr,4.4640000,,,,,,
TYHELVQSAPVISSK,ph,S,147,true,"Tissue atlas Arabidopsis - ProteomicsDB",114,32188942,"MaxQuant score",110.3400000,0.9999720,,,,5.7234201449319E-6,
HSLVSSRASDSSLNR,ph,S,170,true,"TOR Kinase and ABA Receptor",100,29290610,XCorr,2.5830524,0.7765000,,,,0.003093000035733,
SSLGLSPPGNNLDELLHGNFDR,ph,S,312,true,"Large-scale phosphorylation discovery",44,23111157,XCorr,4.7280000,,,,,,
RSSLGLSPPGNNLDELLHGNFDRK,ph,S,313,true,"TOR Kinase and ABA Receptor",100,29290610,XCorr,3.9989882,0.8204000,,,,0.00010610000026645,
RSSLGLSPPGNNLDELLHGNFDR,ph,S,313,true,"Large-scale phosphorylation discovery",44,23111157,XCorr,5.4390000,,,,,,
RSSLGLSPPGNNLDELLHGNFDR,ph,S,313,true,"MAPK Arabidopsis substrates",45,23172892,"MaxQuant Score",82.1770000,,,,,,
RSSLGLSPPGNNLDELLHGNFDR,ph,S,313,true,"PAMP-triggered phosphorylation",48,24601666,"MASCOT Score",49.0300000,,,,,,
RSSLGLSPPGNNLDELLHGNFDR,ph,S,313,true,"TOR Kinase and ABA Receptor",100,29290610,XCorr,3.1531358,0.8733000,,,,1.3990000297781E-5,
RSSLGLSPPGNNLDELLHGNFDR,ph,S,313,true,"Tissue atlas Arabidopsis - ProteomicsDB",114,32188942,"MaxQuant score",242.3500000,0.9628360,,,,0,
SSLGLSPPGNNLDELLHGNFDR,ph,S,317,true,"Large-scale phosphorylation discovery",44,23111157,XCorr,4.0500000,,,,,,
RDDSFQKVNDHPISTVESNLSAK,ph,S,474,true,"PAMP-triggered phosphorylation",48,24601666,"MASCOT Score",44.7500000,,,,,,
RDDSFQKVNDHPISTVESNLSAK,ph,S,474,true,"SnRK2 protein kinase substrates",85,23776212,XCorr,3.9311900,1.0000000,,,,7.8788798418827E-5,
RDDSFQKVNDHPISTVESNLSAK,ph,S,474,true,"Tissue atlas Arabidopsis - ProteomicsDB",114,32188942,"MaxQuant score",280.8800000,1.0000000,,,,0,
DDSFQKVNDHPISTVESNLSAK,ph,S,474,true,"SnRK2 protein kinase substrates",85,23776212,XCorr,2.7508531,1.0000000,,,,6.0916601796634E-5,
RDDSFQK,ph,S,474,true,"Chloroplast kinase substrates",60,19376835,"MASCOT Score",36.8900000,,,,,,0.5413940
VNDHPISTVESNLSAKEPK,ph,S,491,true,"Tissue atlas Arabidopsis - ProteomicsDB",114,32188942,"MaxQuant score",162.2600000,0.9999090,,,,5.3180597230706E-23,
EEAPIVTQTSSSTPDPSSSTLSEK,ph,S,536,true,"Tissue atlas Arabidopsis - ProteomicsDB",114,32188942,"MaxQuant score",199.8900000,0.7701520,,,,0,
EEAPIVTQTSSSTPDPSSSTLSEK,ph,S,548,true,"TOR Kinase and ABA Receptor",100,29290610,XCorr,4.5058999,0.8628000,,,,4.204000106256E-6,
EEAPIVTQTSSSTPDPSSSTLSEK,ph,S,548,true,"Tissue atlas Arabidopsis - ProteomicsDB",114,32188942,"MaxQuant score",231.0700000,0.9873810,,,,0,
SLRKSEDHVENNLSAK,ph,S,551,true,"srk2dei ABA signaling phopshoproteomics",83,23572148,"MASCOT Score",43.0000000,,,,,,-0.0017000
SLRKSEDHVENNLSAK,ph,S,551,true,"Tissue atlas Arabidopsis - ProteomicsDB",114,32188942,"MaxQuant score",62.0050000,0.9999990,,,,0.00051532097859308,
SLRKSEDHVENNLSAK,ph,S,555,true,"Large-scale phosphorylation discovery",44,23111157,XCorr,4.8430000,,,,,,
SLRKSEDHVENNLSAK,ph,S,555,true,"Tyrosine phosphorylation in Arabidopsis",59,18463617,"MASCOT Score",27.0000000,,,,,,-0.8395015
SLRKSEDHVENNLSAK,ph,S,555,true,"srk2dei ABA signaling phopshoproteomics",83,23572148,"MASCOT Score",49.0000000,,,,,,-0.0006000
SLRKSEDHVENNLSAK,ph,S,555,true,"LAXIC - mannitol vs control",84b,23660473,XCorr,3.2500000,0.8310000,,,,0.0022710999473929,
SLRKSEDHVENNLSAK,ph,S,555,true,"SnRK2 protein kinase substrates",85,23776212,XCorr,3.4289842,0.8670000,,,,0.0028224899433553,
SLRKSEDHVENNLSAK,ph,S,555,true,"atm and atr DNA damage response",88,25561503,"MASCOT Score",33.0000000,1.0000000,,,,,0.9100000
SLRKSEDHVENNLSAK,ph,S,555,true,"TOR Kinase and ABA Receptor",100,29290610,XCorr,3.1213396,0.8826000,,,,0.0062899999320507,
SLRKSEDHVENNLSAK,ph,S,555,true,"Phospho cell culture sucrose/TOR",109,30833711,,,0.9980560,,,,,
KSEDHVENNLSAK,ph,S,555,true,"atm and atr DNA damage response",88,25561503,"MASCOT Score",25.0000000,1.0000000,,,,,-1.0500000
SEDHVENNLSAK,ph,S,555,true,"STN8 phosphoproteome",38,21768351,"MASCOT Score",65.1700000,,,,,,-1.3384300
SEDHVENNLSAK,ph,S,555,true,"Chloroplast kinase substrates",60,19376835,"MASCOT Score",59.9300000,,,,,,-1.7879900
SEDHVENNLSAK,ph,S,555,true,"SnRK2 protein kinase substrates",85,23776212,XCorr,2.7357082,1.0000000,,,,0.037861600518227,
SEDHVENNLSAK,ph,S,555,true,"atm and atr DNA damage response",88,25561503,"MASCOT Score",49.0000000,1.0000000,,,,,-1.7100000
SEDHVENNLSAK,ph,S,555,true,"Col-0 callus - FC Col-0 vs. Col-0 Xray",111a,31410901,,35.7900000,,4.6344742,0.0000000,NO,,-0.1734794
SEDHVENNLSAK,ph,S,555,true,"Col-0 X-ray callus - FC Col-0 vs. Col-0 Xray",111b,31410901,,35.7900000,,4.6344742,0.0000000,NO,,-0.1734794
SEDHVENNLSAK,ph,S,555,true,"atm callus - FC atm vs. atm Xray",111c,31410901,,35.7900000,,,0.0000000,NO,,-0.1734794
SEDHVENNLSAK,ph,S,555,true,"Tissue atlas Arabidopsis - ProteomicsDB",114,32188942,"MaxQuant score",204.8100000,1.0000000,,,,0,
KSEDHVENNLSAKEPK,ph,S,564,true,"Tissue atlas Arabidopsis - ProteomicsDB",114,32188942,"MaxQuant score",108.1300000,1.0000000,,,,9.3327898298412E-8,
SEDHVENNLSAK,ph,S,564,true,"TOR Kinase and ABA Receptor",100,29290610,XCorr,3.1055660,0.9996000,,,,0.00037260001408868,
VNEYSVSSVSSDSMVPDQALK,ph,S,583,true,"srk2dei ABA signaling phopshoproteomics",83,23572148,"MASCOT Score",30.0000000,,,,,,-0.0025000
VNEYSVSSVSSDSMVPDQALK,ph,S,585,true,"srk2dei ABA signaling phopshoproteomics",83,23572148,"MASCOT Score",63.0000000,,,,,,-0.0036000
VNEYSVSSVSSDSMVPDQALKEEAPISMK,ph,S,586,true,"Large-scale phosphorylation discovery",44,23111157,XCorr,5.4610000,,,,,,
VNEYSVSSVSSDSMVPDQALKEEAPISMK,ph,S,586,true,"Tissue atlas Arabidopsis - ProteomicsDB",114,32188942,"MaxQuant score",234.1700000,0.9640530,,,,0,
VNEYSVSSVSSDSMVPDQALK,ph,S,586,true,"srk2dei ABA signaling phopshoproteomics",83,23572148,"MASCOT Score",61.0000000,,,,,,-0.0002000
VNEYSVSSVSSDSMVPDQALK,ph,S,588,true,"Large-scale phosphorylation discovery",44,23111157,XCorr,4.7920000,,,,,,
VNEYSVSSVSSDSMVPDQALK,ph,S,588,true,"srk2dei ABA signaling phopshoproteomics",83,23572148,"MASCOT Score",25.0000000,,,,,,-0.0040000
VNEYSVSSVSSDSMVPDQALK,ph,S,588,true,"Tissue atlas Arabidopsis - ProteomicsDB",114,32188942,"MaxQuant score",178.4300000,0.8284060,,,,0,
VNEYSVSSVSSDSMVPDQALKEEAPISMK,ph,S,589,true,"Tissue atlas Arabidopsis - ProteomicsDB",114,32188942,"MaxQuant score",204.1500000,0.9058960,,,,0,
VNEYSVSSVSSDSMVPDQALK,ph,S,589,true,"Large-scale phosphorylation discovery",44,23111157,XCorr,5.0500000,,,,,,
VNEYSVSSVSSDSMVPDQALK,ph,S,589,true,"srk2dei ABA signaling phopshoproteomics",83,23572148,"MASCOT Score",48.0000000,,,,,,-0.0007000
VNEYSVSSVSSDSMVPDQALK,ph,S,589,true,"TOR Kinase and ABA Receptor",100,29290610,XCorr,3.4182997,0.9661000,,,,0.00039299999480136,
EEAPISMK,ph,S,605,true,"atm and atr DNA damage response",88,25561503,"MASCOT Score",24.0000000,1.0000000,,,,,-1.1100000
EEAPISMK,ph,S,605,true,"Tissue atlas Arabidopsis - ProteomicsDB",114,32188942,"MaxQuant score",68.8930000,1.0000000,,,,0.0049670301377773,
ISNSTPDPK,ph,S,609,true,"atm and atr DNA damage response",88,25561503,"MASCOT Score",32.0000000,0.9940000,,,,,0.9000000
ISNSTPDPK,ph,S,609,true,"Tissue atlas Arabidopsis - ProteomicsDB",114,32188942,"MaxQuant score",71.8960000,0.9619710,,,,0.0076705599203706,
ISNSTPDPK,ph,S,611,true,"Tissue atlas Arabidopsis - ProteomicsDB",114,32188942,"MaxQuant score",152.5500000,0.9060880,,,,0.0012171500129625,
SLVYPEKSLR,ph,S,624,true,"Tissue atlas Arabidopsis - ProteomicsDB",114,32188942,"MaxQuant score",114.7600000,0.9999970,,,,0.00035044399555773,
SLRTSQEK,ph,S,628,true,"SnRK2 protein kinase substrates",85,23776212,XCorr,2.2811480,0.9970000,,,,0.063223697245121,
VFHSER,ph,S,686,true,"STN8 phosphoproteome",38,21768351,"MASCOT Score",40.0300000,,,,,,-0.0460417
VFHSER,ph,S,686,true,"Chloroplast kinase substrates",60,19376835,"MASCOT Score",43.5200000,,,,,,1.1230500
VFHSER,ph,S,686,true,"Col-0 callus - FC Col-0 vs. Col-0 Xray",111a,31410901,,38.0200000,,-1.1086638,0.0000000,NO,,-0.2316130
VFHSER,ph,S,686,true,"Col-0 X-ray callus - FC Col-0 vs. Col-0 Xray",111b,31410901,,38.0200000,,-1.1086638,0.0000000,NO,,-0.2316130
VFHSER,ph,S,686,true,"atm callus - FC atm vs. atm Xray",111c,31410901,,38.0200000,,-7.0156927,0.0000000,NO,,-0.2316130
VFHSER,ph,S,686,true,"atm-3 X-ray callus - FC atm vs. atm Xray",111d,31410901,,38.0200000,,-7.0156927,0.0000000,NO,,-0.2316130
DPTETNRLSK,ph,S,700,true,"atm and atr DNA damage response",88,25561503,"MASCOT Score",38.0000000,0.9460000,,,,,-0.0400000
DPTETNRLSK,ph,S,700,true,"Tissue atlas Arabidopsis - ProteomicsDB",114,32188942,"MaxQuant score",171.2000000,0.9993780,,,,2.8704300802929E-7,
NVETNTPEHVSQTETSAK,ph,T,770,true,"TOR Kinase and ABA Receptor",100,29290610,XCorr,3.1236541,0.8843000,,,,0.0054799998179078,
NVETNTPEHVSQTETSAK,ph,T,772,true,"Large-scale phosphorylation discovery",44,23111157,XCorr,4.0230000,,,,,,
NVETNTPEHVSQTETSAK,ph,T,772,true,"srk2dei ABA signaling phopshoproteomics",83,23572148,"MASCOT Score",23.0000000,,,,,,0.0001000
NVETNTPEHVSQTETSAK,ph,T,772,true,"Lateral root-induction - NAA vs control",106,23328941,"MASCOT Score",39.0000000,,,,,,
NVETNTPEHVSQTETSAK,ph,T,772,true,"Tissue atlas Arabidopsis - ProteomicsDB",114,32188942,"MaxQuant score",184.6800000,0.9998120,,,,6.620769892915E-35,
KNVETNTPEHVSQTETSAK,ph,S,777,true,"Chloroplast kinase substrates",60,19376835,"MASCOT Score",39.5400000,,,,,,-0.2877700
KNVETNTPEHVSQTETSAK,ph,S,777,true,"LAXIC - mannitol vs control",84b,23660473,XCorr,3.0800000,0.8830000,,,,0.0032965498976409,
KNVETNTPEHVSQTETSAK,ph,S,777,true,"SnRK2 protein kinase substrates",85,23776212,XCorr,4.0373831,0.9870000,,,,0.0028404300101101,
KNVETNTPEHVSQTETSAK,ph,S,777,true,"Tissue atlas Arabidopsis - ProteomicsDB",114,32188942,"MaxQuant score",353.6600000,0.9999610,,,,0,
NVETNTPEHVSQTETSAK,ph,S,777,true,"STN8 phosphoproteome",38,21768351,"MASCOT Score",53.9500000,,,,,,-1.5526300
NVETNTPEHVSQTETSAK,ph,S,777,true,"Large-scale phosphorylation discovery",44,23111157,XCorr,3.7020000,,,,,,
NVETNTPEHVSQTETSAK,ph,S,777,true,"Chloroplast kinase substrates",60,19376835,"MASCOT Score",42.7400000,,,,,,-0.4386340
NVETNTPEHVSQTETSAK,ph,S,777,true,"srk2dei ABA signaling phopshoproteomics",83,23572148,"MASCOT Score",42.0000000,,,,,,-0.0017000
NVETNTPEHVSQTETSAK,ph,S,777,true,"SnRK2 protein kinase substrates",85,23776212,XCorr,4.5558062,1.0000000,,,,2.2386899445337E-7,
NVETNTPEHVSQTETSAK,ph,S,777,true,"Protein sumoylation and phosphorylation cross-talk",97,28419593,,,,,,,,
NVETNTPEHVSQTETSAK,ph,S,777,true,"TOR Kinase and ABA Receptor",100,29290610,XCorr,5.5999427,0.9917000,,,,2.0869999843853E-6,
NVETNTPEHVSQTETSAK,ph,S,777,true,"Lateral root-induction - NAA vs control",106,23328941,"MASCOT Score",39.0000000,,,,,,
NVETNTPEHVSQTETSAK,ph,S,777,true,"Phospho cell culture sucrose/TOR",109,30833711,,,0.9999420,,,,,
NVETNTPEHVSQTETSAK,ph,S,777,true,"Col-0 callus - FC Col-0 vs. Col-0 Xray",111a,31410901,,75.9200000,,0.5929944,0.0000000,NO,,1.2145092
NVETNTPEHVSQTETSAK,ph,S,777,true,"Col-0 X-ray callus - FC Col-0 vs. Col-0 Xray",111b,31410901,,75.9200000,,0.5929944,0.0000000,NO,,1.2145092
NVETNTPEHVSQTETSAK,ph,S,777,true,"atm callus - FC atm vs. atm Xray",111c,31410901,,75.9200000,,0.1082764,0.0000000,NO,,1.2145092
NVETNTPEHVSQTETSAK,ph,S,777,true,"atm-3 X-ray callus - FC atm vs. atm Xray",111d,31410901,,75.9200000,,0.1082764,0.0000000,NO,,1.2145092
NVETNTPEHVSQTETSAK,ph,T,779,true,"Chloroplast kinase substrates",60,19376835,"MASCOT Score",40.0000000,,,,,,-0.2779650
NVETNTPEHVSQTETSAK,ph,S,782,true,"srk2dei ABA signaling phopshoproteomics",83,23572148,"MASCOT Score",25.0000000,,,,,,0.0000000
TKESLNFPGLGPLHADGAGVSLNIQNNDPK,ph,S,818,true,"Tissue atlas Arabidopsis - ProteomicsDB",114,32188942,"MaxQuant score",283.2000000,0.9939230,,,,0,
TWSYFR,ph,S,847,true,"srk2dei ABA signaling phopshoproteomics",83,23572148,"MASCOT Score",38.0000000,,,,,,-0.0006000
GAESTDATLNAGVPLIDFMAADSGMR,ph,S,942,true,"Large-scale phosphorylation discovery",44,23111157,XCorr,6.4330000,,,,,,
GAESTDATLNAGVPLIDFMAADSGMR,ph,T,943,true,"Large-scale phosphorylation discovery",44,23111157,XCorr,5.9600000,,,,,,
GTDVAIKR,ac,K,1001,false,"Quantitative Acetylproteomics",101,29440448,,,,,,,,
RSCFIGRSSEQER,ph,S,1006,true,"srk2dei ABA signaling phopshoproteomics",83,23572148,"MASCOT Score",28.0000000,,,,,,-0.0014000
RSCFIGRSSEQER,ph,S,1012,true,"srk2dei ABA signaling phopshoproteomics",83,23572148,"MASCOT Score",32.0000000,,,,,,-0.0012000
SCFIGRSSEQER,ph,S,1012,true,"srk2dei ABA signaling phopshoproteomics",83,23572148,"MASCOT Score",23.0000000,,,,,,-0.0005000
SCFIGRSSEQER,ph,S,1012,true,"atm and atr DNA damage response",88,25561503,"MASCOT Score",30.0000000,1.0000000,,,,,0.3600000
SCFIGRSSEQER,ph,S,1012,true,"Col-0 callus - FC Col-0 vs. Col-0 Xray",111a,31410901,,22.2900000,,-0.0034353,0.0000000,NO,,1.0232953
SCFIGRSSEQER,ph,S,1012,true,"Col-0 X-ray callus - FC Col-0 vs. Col-0 Xray",111b,31410901,,22.2900000,,-0.0034353,0.0000000,NO,,1.0232953
SCFIGRSSEQER,ph,S,1012,true,"atm callus - FC atm vs. atm Xray",111c,31410901,,22.2900000,,-0.5784038,0.0000000,NO,,1.0232953
SCFIGRSSEQER,ph,S,1012,true,"atm-3 X-ray callus - FC atm vs. atm Xray",111d,31410901,,22.2900000,,-0.5784038,0.0000000,NO,,1.0232953
SCFIGRSSEQER,ph,S,1012,true,"Tissue atlas Arabidopsis - ProteomicsDB",114,32188942,"MaxQuant score",147.3500000,0.9999230,,,,2.5567399575266E-7,
SCFIGRSSEQER,ph,S,1013,true,"srk2dei ABA signaling phopshoproteomics",83,23572148,"MASCOT Score",33.0000000,,,,,,-0.0016000
SCFIGRSSEQER,ph,S,1013,true,"SnRK2 protein kinase substrates",85,23776212,XCorr,3.2444134,0.8610000,,,,5.8234199968865E-5,
SCFIGRSSEQER,ph,S,1013,true,"atm and atr DNA damage response",88,25561503,"MASCOT Score",30.0000000,1.0000000,,,,,0.3600000
SCFIGRSSEQER,ph,S,1013,true,"Tissue atlas Arabidopsis - ProteomicsDB",114,32188942,"MaxQuant score",133.6600000,0.9999950,,,,7.5897901297139E-6,
RNTLVTGGVR,ph,T,1134,true,"atm and atr DNA damage response",88,25561503,"MASCOT Score",47.0000000,1.0000000,,,,,0.9800000
RNTLVTGGVR,ph,T,1134,true,"Tissue atlas Arabidopsis - ProteomicsDB",114,32188942,"MaxQuant score",135.0200000,1.0000000,,,,4.1693601815496E-5,
NTLVTGGVR,ph,T,1134,true,"atm and atr DNA damage response",88,25561503,"MASCOT Score",52.0000000,1.0000000,,,,,0.5600000
RNTLVTGGVR,ph,T,1137,true,"atm and atr DNA damage response",88,25561503,"MASCOT Score",47.0000000,1.0000000,,,,,0.9800000
RNTLVTGGVR,ph,T,1137,true,"Tissue atlas Arabidopsis - ProteomicsDB",114,32188942,"MaxQuant score",97.1750000,1.0000000,,,,0.0038972799666226,
NTLVTGGVR,ph,T,1137,true,"atm and atr DNA damage response",88,25561503,"MASCOT Score",35.0000000,1.0000000,,,,,0.5100000
NTLVTGGVR,ph,T,1137,true,"Phospho cell culture sucrose/TOR",109,30833711,,,0.9999840,,,,,
