Peptide,PTM,ModifiedAA,ModifiedPosition,PeptideUniqueToGene,ExperimentDesc,ExpID,PubmedID,ScoreType,IdentScore,LocProb,Log2FChange,PQ-val,QuantSig,PEP,MassErrorPPM
TSLCPSFVAVR,ph,S,45,true,"Tissue atlas Arabidopsis - ProteomicsDB",114,32188942,"MaxQuant score",107.9700000,1.0000000,,,,3.5895198379876E-5,
AMAESQTAQR,nt,A,51,true,"Tic56 chloroplast import - tic56-1",89c,25588737,XCorr,3.0219152,,,,,,
AMAESQTAQR,nt,A,51,true,"Arabidopsis translation initiation landscape - NT",167b,35069635,,,,,,,,
AMAESQTAQR,nta,A,51,true,"Characterization plant N-terminal acetylation",6,22223895,"MASCOT Score",57.7600000,,,,,,
AMAESQTAQR,nta,A,51,true,"Arabidopsis translation initiation landscape - NTA",167a,35069635,,,,,,,,
AESQTAQRNQPQSSGSSGEKQALISLS,nt,A,53,true,"Arabidopsis translation initiation landscape - NT",167b,35069635,,,,,,,,
AESQTAQR,nt,A,53,true,"Arg/N-end rule seed, prt6 vs. Wt",99,29168982,"MASCOT Score",28.7800000,,0.6126503,0.0724193,NO,0.18850000202656,-0.6315395
ESQTAQRNQPQSSGSSGEKQALISLS,nt,E,54,true,"Arabidopsis translation initiation landscape - NT",167b,35069635,,,,,,,,
QALISLSDKR,ac,K,81,true,"Histone deacetylases substrates - hda14 vs WT",98e,29061669,"MaxQuant Score",78.3000000,1.0000000,-0.0530000,0.9204496,NO,0.0010000000474975,
QALISLSDKR,ac,K,81,true,"Quantitative Acetylproteomics",101,29440448,,,,,,,,
SGDYQAVLE,nt,S,217,true,"Arg/N-end rule seed, prt6 vs. Wt",99,29168982,"MASCOT Score",32.6200000,,0.5893002,0.1612116,NO,0.035969998687506,-2.2607341
HTNPCGVASRDDILEAYR,ox,C,352,true,"SPEAR - 10 mM H2O2 / mock",138a,34619326,,,,2.2088606,0.0060149,YES,,
HTNPCGVASRDDILEAYR,so,C,352,true,"S-sulfenylation site detection using YAP1C",110,32714340,,,,,,,,
HTNPCGVASR,so,C,352,true,"Arabidopsis S-sulfenylation chemoproteomics",108,31578252,"pFind PSM Score",0.1791350,,0.7867900,,,,0.3704863
GLEVLKGK,ac,K,426,true,"Quantitative Acetylproteomics",101,29440448,,,,,,,,
HVKSNAIVIAK,ac,K,496,true,"Quantitative Acetylproteomics",101,29440448,,,,,,,,
NNCMLGMGSGQPNR,so,C,507,true,"S-sulfenylation site detection using YAP1C",110,32714340,,,,,,,,
